program: Gaussian 09
title: 000147290
version: EM64L-G09RevD.01
frameworkgroup: C1[X(C13H8ClN)]
method: RPBEPBE
basis: SDD
operation: Freq
keyword: #p
keyword: freq=noraman
keyword: PBEPBE/SDD
title: #p freq=noraman PBEPBE/SDD
converged: NO NO NO YES
title: Mulliken charges:
elementType: Cl N C C C C C C C C C C C C C H H H H H H H H
charge: -0.018351 0.007096 0.452507 0.426113 -0.000524 -0.080624 -0.446665 -0.415708 -0.391155 -0.224686 -0.307000 -0.240975 -0.249375 -0.246173 -0.223622 0.252942 0.239319 0.236629 0.270927 0.235393 0.257411 0.232045 0.234478
chargesum: 0.00000
title: Mulliken charges with hydrogens summed into heavy atoms:
elementType: Cl N C C C C C C C C C C C C C
charge: -0.018351 0.007096 0.452507 0.426113 -0.000524 -0.080624 -0.193724 -0.176389 -0.154526 -0.224686 -0.036074 -0.005583 0.008036 -0.014128 0.010856
polarizability: 2.75362319e+02 1.82883798e+01 1.76617207e+02 -1.12452981e-03 9.53791383e-05 5.73778584e+01
1716.lowfreq: -0.0011 -0.0010 0.0024 8.9002 12.2815 13.9172 77.2322 96.0422 145.3619
frequency: 77.1138 96.0411 145.3559 178.3406 249.8531 282.0051 282.6592 362.0652 401.7023 418.9614 454.3610 474.2570 499.8244 523.7685 552.8583 588.1327 606.4728 639.5629 658.9577 748.2204 749.3617 769.0258 783.0502 818.4318 835.0369 873.8025 896.0705 902.5263 925.2623 932.0890 972.7788 977.2022 998.8774 1008.6935 1056.2857 1114.8418 1150.5784 1168.2529 1184.4162 1200.2738 1240.9199 1262.7971 1299.1535 1332.0010 1355.5145 1392.4319 1414.1430 1425.3107 1456.4695 1474.5520 1519.2028 1544.5722 1576.4914 1612.3161 1632.3419 3120.9712 3122.3665 3129.2852 3137.1407 3152.9232 3156.8922 3171.2656 3172.3782
redmass: 5.3847 5.1623 11.3711 4.8146 5.1030 6.0361 4.0686 7.8504 4.0372 7.5899 6.1102 2.8882 3.4539 6.7071 4.1398 3.5717 7.3120 6.2381 8.4810 1.7754 5.9072 1.5282 1.8321 3.1412 5.2639 1.4929 1.4065 6.2760 6.9852 1.6330 1.3563 1.3857 1.3297 2.2266 2.1693 1.9611 1.4496 1.1403 1.2833 1.6254 2.6221 2.1014 2.2730 4.0404 2.0202 2.6209 6.9994 2.9568 3.2735 3.0609 7.3667 7.7562 5.5457 6.8190 6.6387 1.0906 1.0886 1.0875 1.0893 1.0928 1.0955 1.0978 1.0990
irintensity: 0.0581 3.2245 1.1836 1.4230 1.2920 0.8529 0.1170 2.5318 0.0002 1.6084 0.3573 8.5311 0.0400 1.1080 0.3503 0.6622 5.2771 2.8451 24.5555 85.8391 7.9341 35.9806 24.2467 0.1916 9.5423 16.9102 7.0727 1.6591 39.0160 22.9021 1.8258 8.4900 0.2211 6.2182 5.7403 19.9389 1.2000 0.3199 2.7281 12.1584 3.9939 0.0665 8.8284 13.6780 8.7492 0.4555 16.4834 11.9266 21.9704 3.7820 34.2245 5.4537 1.8200 8.0157 6.4412 1.5384 8.5720 3.2771 13.1944 18.3580 25.9865 15.6430 19.3855
temp: 298.150 k
press: 1.00000 atm
elementType: 17 7 6 6 6 6 6 6 6 6 6 6 6 6 6 1 1 1 1 1 1 1 1
symmnumber: 1
zpe: 444166.3 jmol-1
zpe.correction: 0.169174 hartree
zpe.thermalcorrener: 0.179966 hartree
zpe.thermalcorrenthalpy: 0.180911 hartree
zpe.thermalcorrgfe: 0.132173 hartree
zpe.sumelectzpe: -1014.000212 hartree
zpe.sumelectthermal: -1013.989420 hartree
zpe.sumelectthermalent: -1013.988476 hartree
zpe.sumelectthermalfe: -1014.037214 hartree
dipole: -1.5853 3.6825 0.0000
dipole: 4.0092
quadrupole: -75.2957 -85.0061 -98.4457
quadrupole: 5.9461 -0.0001 0.0001
quadrupole: 10.9535 1.2431 -12.1965 5.9461 -0.0001 0.0001
hfenergy: -1014.1693864 hartree
pointgroup: C01 [X(C13H8Cl1N1)]
dipole: -0.4236792 -1.5193665 -0.0000006 debye
dipolederiv: -0.1206756 -0.1117873 -0.0000006 -0.2931319 -0.7622628 -0.0000023 -0.0000005 -0.0000003 -0.0455525 -0.4713299 0.0651104 -0.0000002 0.0386529 -0.2476984 0.0000003 -0.0000009 0.0000013 -0.228952 -0.1076748 -0.0941708 -0.0000013 -0.198478 -0.166268 -0.0000014 -0.0000024 -0.0000018 0.0782599 -0.0303581 0.0031051 0.0000002 0.2180692 -0.2461242 0. 0.0000019 -0.0000008 0.074721 0.3089824 -0.1461882 0.0000024 -0.0089026 -0.1658145 -0.0000004 0.0000022 -0.0000016 0.0866575 0.3591286 0.0089025 -0.0000011 -0.2407049 0.0709601 -0.0000011 -0.0000039 -0.0000015 0.0778947 0.1989229 0.0237544 0.0000031 -0.0122012 0.2179576 0.0000015 0.0000018 0.0000027 -0.1544402 -0.0267913 0.0059394 0.0000007 -0.0944228 0.0704139 -0.0000007 0.0000029 0.0000027 -0.1794876 0.0097332 0.0139067 0.000001 0.1188937 0.1123909 0.0000031 0.0000029 0.0000035 -0.1714525 0.0952805 0.17301 0.0000011 0.5040172 1.1681684 0.0000038 0.0000005 0.0000006 -0.0928032 -0.1555322 0.0083237 0. -0.0359212 0.1047904 0.0000012 0.000001 0.000003 -0.1632848 -0.0177367 -0.0776401 -0.0000001 -0.0805415 0.1549414 0.0000003 -0.0000001 -0.0000002 -0.1549099 -0.0592121 0.1583507 0.0000008 0.0377247 -0.2554815 0.0000003 0.0000015 0.0000014 -0.1062544 0.0233966 0.147336 -0.0000004 0.1674602 0.0056582 0.0000011 -0.0000024 0. -0.1520374 -0.0177723 -0.1349745 -0.0000015 -0.1434506 0.106898 0.0000013 -0.0000004 0.0000014 -0.1484791 0.0632323 -0.0179809 -0.0000007 -0.0152086 -0.0806267 -0.0000012 -0.0000014 -0.0000018 0.1420604 0.0680745 -0.0581685 -0.0000005 0.0391187 -0.098811 0. 0.0000002 -0.000002 0.1650953 0.0609749 0.0171875 -0.0000005 -0.0812117 -0.1019774 -0.0000024 -0.0000016 -0.0000025 0.1599946 0.0904893 -0.0496366 -0.0000001 0.0265302 -0.0353537 -0.0000013 0.0000008 -0.0000021 0.161673 -0.063273 0.0971661 -0.0000008 0.089108 0.0109618 0.0000002 -0.0000023 0.0000002 0.1640915 -0.0269497 -0.0604849 -0.0000014 -0.0670628 0.0651661 -0.0000008 -0.0000013 -0.0000008 0.16543 -0.1163824 -0.0752744 -0.0000004 -0.0761297 0.0615436 -0.0000007 0.0000013 -0.0000004 0.1622426 -0.064527 0.1042138 0.0000004 0.1077928 0.0105678 -0.0000009 0. -0.0000009 0.159533 unknown
polarizability: 278.4478218|-4.5017968|173.531704|0.0011016|0.0002454|57.3778584 unknown
InChI: InChI=1S/C13H8ClN/c14-11-6-3-5-10-8-9-4-1-2-7-12(9)15-13(10)11/h1-8H
charge 0 multiplicity 1
23 atoms
Cl 2.57472 2.750734 0.000032
N  -0.035629 1.2039 0.000007
C  0.956853 -1.079316 0.000019
C  -1.489051 -0.817374 0.0000
C  1.056246 0.384594 0.000017
C  -1.280578 0.630992 0.000002
C  -0.341939 -1.644681 0.000006
C  2.150577 -1.88138 0.000027
C  -2.833733 -1.330925 -0.000008
C  2.387575 0.949907 0.00003
C  -2.429976 1.497042 0.000007
C  3.402857 -1.277753 0.00003
C  3.525721 0.153191 0.000035
C  -3.920382 -0.462022 -0.000007
C  -3.715343 0.963125 0.000004
H  -0.4551 -2.736227 -0.000001
H  2.056167 -2.973511 0.000025
H  -2.986937 -2.417021 -0.000018
H  -2.247493 2.575796 0.000016
H  4.313914 -1.885019 0.000032
H  4.516013 0.618663 0.000042
H  -4.941937 -0.85761 -0.000008
H  -4.585044 1.629595 0.000008
