program: Gaussian 09
title: 000147250
version: EM64L-G09RevD.01
frameworkgroup: C1[X(C8H11N3O2)]
method: RPBEPBE
basis: SDD
operation: Freq
keyword: #p
keyword: freq=noraman
keyword: PBEPBE/SDD
title: #p freq=noraman PBEPBE/SDD
converged: YES YES NO NO
title: Mulliken charges:
elementType: O O N N N C C C C C C C C H H H H H H H H H H H
charge: -0.235626 -0.194448 -0.157080 -0.051394 0.069185 0.275501 -0.426086 -0.292737 0.420714 0.092910 -0.636988 -0.785103 -0.808976 0.230196 0.301305 0.255236 0.255369 0.243952 0.225045 0.229180 0.229547 0.219231 0.217889 0.323177
chargesum: 0.00000
title: Mulliken charges with hydrogens summed into heavy atoms:
elementType: O O N N N C C C C C C C C
charge: -0.235626 -0.194448 -0.157080 -0.051394 0.069185 0.275501 -0.195890 0.008568 0.420714 0.092910 0.117569 -0.101330 -0.048679
polarizability: 1.95352878e+02 -9.53408032e+00 1.39458878e+02 9.93590602e-03 -8.05498404e-02 6.02833328e+01
1716.lowfreq: -1.6622 0.0003 0.0007 0.0011 4.7605 9.3625 46.3161 58.8128 84.0393
frequency: 46.2915 58.8104 84.0377 96.5933 100.2344 135.4036 154.4844 176.6305 202.0862 244.9760 260.8880 313.4357 366.9259 382.7091 405.4652 476.7032 501.2304 549.8898 594.1746 652.2235 695.2883 714.1330 737.0383 800.7559 833.0566 840.7886 869.6954 956.7551 963.8572 980.8727 1046.6969 1065.3723 1083.9519 1100.4279 1119.9595 1137.3872 1214.1061 1231.8384 1284.5538 1314.8628 1360.9383 1377.7094 1389.7499 1397.4306 1403.0520 1448.2338 1453.6690 1456.8780 1465.6844 1473.5209 1482.9533 1492.3731 1498.6059 1508.4695 1665.2869 2961.5798 2966.1390 3001.8278 3030.8439 3038.4961 3082.1929 3091.1926 3112.4425 3117.7692 3122.7752 3268.9563
redmass: 3.1384 6.6534 1.3683 2.2170 5.1185 1.1599 1.3431 1.9887 4.4703 4.1148 3.4280 4.2108 4.0849 3.9589 4.0435 2.3098 4.8278 4.9322 4.8859 4.6727 4.4078 6.0815 11.2890 1.5641 4.4304 1.4601 4.5261 1.5323 5.7043 1.2351 1.7066 1.6633 1.7004 1.8589 1.3289 2.5384 5.6184 3.1570 5.0233 6.4467 11.0176 1.7377 1.4777 1.7712 1.3652 1.4281 1.0496 1.0883 1.5065 1.0407 1.3173 1.0471 2.1607 3.7729 5.9762 1.0384 1.0381 1.0344 1.0953 1.0957 1.0991 1.1026 1.0887 1.0981 1.0999 1.1013
irintensity: 1.2375 0.6776 0.1879 3.2128 2.3857 0.1012 2.3730 0.2088 1.5909 0.5767 0.0684 0.7936 0.8642 0.8456 1.3824 9.7997 2.3699 1.5684 0.0362 4.4576 14.3409 3.1784 27.2219 36.0643 3.6868 17.4301 16.2392 1.5244 8.1700 5.5867 27.2483 44.9515 6.7901 8.6074 1.0881 12.4345 169.9993 155.7814 9.2887 31.9450 154.1789 2.6429 16.8401 10.1158 27.4942 3.8034 8.5412 15.1932 16.7542 17.4330 3.7272 24.4213 52.8068 77.9085 114.1513 10.1443 77.2662 29.1758 7.6613 31.1723 27.1100 14.5179 16.3443 4.5707 10.1854 9.2735
temp: 298.150 k
press: 1.00000 atm
elementType: 8 8 7 7 7 6 6 6 6 6 6 6 6 1 1 1 1 1 1 1 1 1 1 1
symmnumber: 1
zpe: 487259.1 jmol-1
zpe.correction: 0.185587 hartree
zpe.thermalcorrener: 0.199095 hartree
zpe.thermalcorrenthalpy: 0.200039 hartree
zpe.thermalcorrgfe: 0.144634 hartree
zpe.sumelectzpe: -625.077508 hartree
zpe.sumelectthermal: -625.064001 hartree
zpe.sumelectthermalent: -625.063056 hartree
zpe.sumelectthermalfe: -625.118461 hartree
dipole: 6.4642 6.3636 0.0118
dipole: 9.0710
quadrupole: -85.8668 -68.1200 -77.0683
quadrupole: -9.6803 -0.0175 0.0038
quadrupole: -8.8484 8.8983 -0.0499 -9.6803 -0.0175 0.0038
hfenergy: -625.2630954 hartree
pointgroup: C01 [X(C8H11N3O2)]
dipole: 2.6541632 2.3679761 -0.2904367 debye
dipolederiv: -1.0915944 0.0653737 0.0280444 0.1707846 -0.4795422 0.0112565 0.0198465 0.0153456 -0.2593457 -0.4986117 -0.099313 0.0192104 -0.2414456 -0.8403893 0.060002 0.0301655 0.0539028 -0.2216629 -0.4841967 -0.5667389 0.0599787 0.1233536 -0.4474953 0.0220233 0.0066731 0.0482177 -0.1048998 -0.2563885 0.0789158 -0.0029847 -0.1549647 -0.3533223 0.0190434 0.0156462 0.009626 -0.1887503 1.8295485 0.3124309 -0.0898537 0.4783805 1.2805645 -0.1070139 -0.1026123 -0.099524 0.2075254 0.6677244 -0.2667682 -0.0029369 -0.4566284 0.2991209 0.0043061 0.011096 -0.0032557 0.1039597 -0.3856881 0.1437536 -0.0060692 0.5125664 -0.2125912 -0.0246972 -0.0354654 -0.0096958 -0.2446991 0.0272817 0.6324583 -0.0549997 0.3071732 0.2851501 -0.0442531 -0.03049 -0.0574406 -0.1163419 0.5302703 -0.0570189 -0.0208525 -0.4510967 0.4853053 -0.0262905 0.012867 -0.0445461 -0.0476208 -0.4288065 -0.3187731 0.0433676 -0.4142718 -0.3915658 0.0517628 0.0516106 0.0466703 0.0376052 0.1441969 0.1670473 -0.0111951 0.0736752 0.430666 -0.0219015 -0.0028923 -0.0247432 0.2024575 -0.2092225 -0.0284489 0.0141624 0.132724 -0.0000136 -0.0012306 0.004368 0.005402 0.0541539 -0.2495546 0.0160935 0.0109188 0.0096244 -0.2387005 0.0268383 0.0045622 0.0319135 0.068236 0.0130801 -0.0549371 0.0108478 -0.0914418 -0.0854904 0.0242613 0.0133371 0.0229765 0.1615912 0.1181957 0.0072805 0.0037759 0.03575 0.0725367 0.0098948 0.0014738 0.0114079 0.2218673 0.0324638 -0.1060173 -0.0870853 -0.0386676 0.036028 0.018836 -0.0906493 -0.0357393 -0.0195542 0.0504521 -0.0891183 0.0946757 -0.0280189 0.0358283 -0.0245815 0.0888696 0.0365615 -0.0404719 -0.0242743 0.1355809 -0.001949 0.031498 -0.006267 0.0083164 0.0051941 0.0035211 0.1290154 0.0436788 -0.0220271 0.004213 -0.1377142 -0.1349909 0.0236996 0.0127208 0.0192984 0.1036272 -0.0358885 0.0502708 -0.0521961 0.027896 0.0669808 0.0956914 -0.1373461 0.0913574 -0.0467353 -0.021364 0.0485707 0.0434813 0.0393141 0.0361776 -0.1119728 0.1299989 -0.1088572 -0.0315404 0.0784266 0.024888 -0.1014772 0.0608149 0.027034 0.0530087 -0.1160425 0.1123941 -0.0496435 0.088793 0.03672 0.0904809 0.0758159 -0.0036032 -0.0681333 0.1003206 -0.1261983 -0.0309254 0.0614781 -0.110223 0.0084425 -0.0651212 0.1385797 0.0011339 0.0067478 0.0014053 0.1121522 unknown
polarizability: 194.1240048|-12.4615627|140.0394713|-4.5794437|-5.7900151|60.9316131 unknown
InChI: InChI=1S/C8H11N3O2/c1-6(2)4-7-9-8(11(12)13)5-10(7)3/h4-5H,1-3H3
charge 0 multiplicity 1
24 atoms
O  -3.891938 -0.009917 0.294325
O  -2.755747 -1.996921 0.408475
N  -0.10633 1.682144 0.010806
N  -0.311009 -0.578665 0.192587
N  -2.796864 -0.714551 0.30712
C  0.583479 0.437788 0.076976
C  2.036911 0.374443 0.019577
C  -1.46586 1.418781 0.087615
C  2.837578 -0.740934 0.075142
C  -1.555674 0.025642 0.198142
C  0.498335 3.017126 -0.117221
C  4.345155 -0.588699 -0.002099
C  2.330284 -2.159384 0.212649
H  2.537099 1.346348 -0.080974
H  -2.235405 2.182719 0.061175
H  1.165516 3.226157 0.736379
H  1.074536 3.096101 -1.054968
H  -0.299688 3.77494 -0.13133
H  4.662007 0.464607 -0.093701
H  4.827032 -1.018332 0.898259
H  4.749021 -1.149037 -0.868368
H  2.740776 -2.620569 1.133429
H  2.696744 -2.776961 -0.631709
H  1.232945 -2.208928 0.246016
