program: Gaussian 09
title: 000147247
version: EM64L-G09RevD.01
frameworkgroup: C1[X(C8H19N3)]
method: RPBEPBE
basis: SDD
operation: Freq
keyword: #pfreq=noraman
keyword: PBEPBE/SDD
title: #p freq=noraman PBEPBE/SDD
converged: YES YES NO NO
title: Mulliken charges:
elementType: N N N C C C C C C C C H H H H H H H H H H H H H H H H H H H
charge: -0.295917 -0.148879 0.002144 -0.327887 -0.349569 -0.384490 -0.350721 -0.339632 -0.425956 -0.683759 -0.691179 0.211448 0.189631 0.190769 0.201430 0.203296 0.235797 0.186605 0.194676 0.225357 0.184987 0.199184 0.213711 0.213359 0.216845 0.208024 0.293347 0.208864 0.204097 0.214419
chargesum: 0.00000
title: Mulliken charges with hydrogens summed into heavy atoms:
elementType: N N N C C C C C C C C
charge: -0.002570 -0.148879 0.002144 0.073192 0.042630 0.054603 0.030560 0.070712 -0.013061 -0.045531 -0.063799
polarizability: 1.55576851e+02 3.22927541e+00 1.01318099e+02 4.57993557e+00 -3.22751839e+00 9.28634767e+01
1716.lowfreq: -13.1016 -3.3618 -0.0004 0.0004 0.0005 6.6709 18.2769 24.9852 59.1579
frequency: 14.5908 24.5180 59.0954 69.7080 85.9656 103.0245 123.9239 181.9644 202.2157 232.6329 236.8235 254.0948 280.4673 296.0884 343.7008 453.2632 498.9060 521.0265 558.4712 599.3893 736.3532 742.0719 808.2401 828.6351 833.0230 856.6041 920.8780 934.0323 963.2619 983.9494 1032.5995 1041.9752 1067.3855 1078.9809 1115.3648 1116.1238 1128.1041 1154.1458 1186.3345 1211.8024 1233.5556 1241.9307 1274.1948 1286.9048 1287.9570 1299.6647 1313.8074 1329.9483 1347.3502 1357.5082 1359.3673 1389.2318 1392.1383 1398.5192 1444.6634 1453.9544 1456.0817 1459.3763 1467.8944 1473.8705 1476.0080 1477.9997 1479.1401 1485.4904 1486.8149 2949.9431 2961.2752 2967.7613 2970.2803 2972.2913 2974.3171 2975.6590 2994.5921 3006.9334 3011.2745 3023.3688 3039.5042 3042.4663 3067.9022 3069.2698 3069.7613 3071.0357 3074.4609 3408.4130
redmass: 3.4526 2.9183 2.3508 1.6202 2.1460 2.9055 3.7838 4.2525 2.5830 1.1458 1.1191 2.1975 2.1174 2.8747 3.4958 2.6923 3.0152 2.4911 2.8822 1.3979 1.1659 1.1501 1.6901 1.5242 2.1984 1.6042 1.3917 1.6506 1.4572 1.9597 3.8469 2.3259 2.0234 2.4926 1.9404 1.7373 2.0307 2.6891 2.8511 1.3733 1.3686 1.3002 1.4633 1.1215 1.1038 1.3045 1.2605 1.3922 1.4278 1.5391 1.4036 1.2270 1.2266 3.1311 1.1770 1.1073 1.0815 1.0861 1.5000 1.0931 1.0510 1.0431 1.0424 1.0760 1.0843 1.0565 1.0592 1.0521 1.0438 1.0584 1.0381 1.0651 1.0656 1.0965 1.1005 1.0984 1.1011 1.1010 1.1015 1.0995 1.1004 1.1008 1.0996 1.0750
irintensity: 0.1062 0.3521 0.1421 0.0968 0.6697 0.2814 5.2637 4.4533 7.5777 0.6384 0.0528 3.0342 4.3618 2.4984 1.7464 17.0881 6.7036 5.5903 15.5004 128.1726 22.0621 4.0125 1.6473 0.4013 3.5323 4.0410 9.6665 0.6586 3.7071 9.6443 0.5058 6.7652 6.6069 3.0566 2.9037 4.0613 3.8184 5.9403 155.3597 25.3478 17.8827 10.7309 17.7356 0.1411 6.1574 2.9067 6.8883 11.6611 1.8208 2.4311 16.4444 9.4531 12.9234 64.4474 23.0432 32.5858 5.7490 6.6187 94.7114 6.9380 2.2259 10.8014 13.3338 13.4575 15.8946 50.4283 18.4049 20.1182 56.9320 38.4827 46.8377 50.4636 40.3326 1.8168 24.7183 35.9294 61.8894 13.6676 18.8766 66.5943 103.0301 60.8971 57.8259 0.1992
temp: 298.150 k
press: 1.00000 atm
elementType: 7 7 7 6 6 6 6 6 6 6 6 1 1 1 1 1 1 1 1 1 1 1 1 1 1 1 1 1 1 1
symmnumber: 1
zpe: 701033.3 jmol-1
zpe.correction: 0.267009 hartree
zpe.thermalcorrener: 0.281460 hartree
zpe.thermalcorrenthalpy: 0.282404 hartree
zpe.thermalcorrgfe: 0.222952 hartree
zpe.sumelectzpe: -479.522316 hartree
zpe.sumelectthermal: -479.507865 hartree
zpe.sumelectthermalent: -479.506921 hartree
zpe.sumelectthermalfe: -479.566373 hartree
dipole: -1.7098 0.3904 -0.0504
dipole: 1.7545
quadrupole: -63.0493 -72.0528 -69.8312
quadrupole: 0.2985 3.0164 -0.3454
quadrupole: 5.2618 -3.7416 -1.5201 0.2985 3.0164 -0.3454
hfenergy: -479.7893256 hartree
pointgroup: C01 [X(C8H19N3)]
dipole: -0.672241 0.1471282 -0.0540616 debye
polarizability: 155.4519587|4.0900523|100.0224875|4.7726573|-4.3868433|94.2839797 unknown
InChI: InChI=1S/C8H19N3/c1-3-5-7-9-11-10-8-6-4-2/h9H,3-8H2,1-2H3
charge 0 multiplicity 1
30 atoms
N  -1.159537 -1.434234 -0.510312
N  1.043088 -1.205679 -0.231241
N  -0.095663 -1.476849 0.349395
C  -3.100439 -0.155305 0.502554
C  -3.299759 0.852968 -0.651423
C  -2.510587 -1.515978 0.051985
C  2.955706 0.034163 0.782125
C  3.597615 0.437479 -0.564729
C  2.180213 -1.302086 0.725248
C  -3.892605 2.195047 -0.170157
C  4.342639 1.786812 -0.484223
H  -2.431839 0.28182 1.270628
H  -4.075468 -0.34676 0.996395
H  -3.966586 0.405872 -1.417799
H  -2.326701 1.040431 -1.148882
H  -3.168004 -1.976688 -0.710664
H  -2.461171 -2.206337 0.912698
H  3.7491 -0.058072 1.552738
H  2.269806 0.835602 1.123203
H  2.80885 0.479084 -1.338994
H  4.302717 -0.358888 -0.880863
H  2.861583 -2.094253 0.35213
H  1.824937 -1.592304 1.735971
H  -3.225811 2.678454 0.568277
H  -4.03446 2.899529 -1.010064
H  -4.875446 2.043318 0.314874
H  -0.984667 -1.1373 -1.481469
H  3.651101 2.605107 -0.206728
H  5.145395 1.755176 0.277416
H  4.806191 2.051571 -1.452589
