program: Gaussian 09
title: 000010158
version: EM64L-G09RevD.01
frameworkgroup: C1[X(C21H22O7)]
method: RPBEPBE
basis: SDD
operation: Freq
keyword: #pfreq=noraman
keyword: PBEPBE/SDD
title: #p freq=noraman PBEPBE/SDD
converged: YES YES NO NO
title: Mulliken charges:
elementType: O O O O O O O C C C C C C C C C C C C C C C C C C C C C H H H H H H H H H H H H H H H H H H H H H H
charge: -0.255710 -0.297237 -0.276363 -0.261552 -0.260588 -0.233540 -0.194652 0.309253 -0.168991 -0.154358 0.225905 0.187938 -0.748205 -0.724636 0.013901 -0.409766 0.419420 -0.417369 0.270822 -0.276673 0.320840 0.114543 -0.313231 -0.480212 -0.763813 0.457858 -0.777927 -0.800077 0.293616 0.308928 0.248097 0.233984 0.231117 0.265744 0.230813 0.222814 0.259385 0.242565 0.245234 0.251936 0.258039 0.241787 0.266492 0.245175 0.231696 0.240147 0.229354 0.300776 0.227474 0.219246
chargesum: 0.00000
title: Mulliken charges with hydrogens summed into heavy atoms:
elementType: O O O O O O O C C C C C C C C C C C C C C C C C C C C C
charge: -0.255710 -0.297237 -0.276363 -0.261552 -0.260588 -0.233540 -0.194652 0.309253 0.124626 0.154570 0.225905 0.187938 -0.035006 -0.005265 0.013901 -0.150381 0.419420 -0.174804 0.270822 -0.031439 0.320840 0.114543 -0.061296 -0.222173 -0.010360 0.457858 -0.076730 -0.052581
polarizability: 3.26392377e+02 -9.19526977e+00 2.64331733e+02 2.82004627e+01 -1.33983563e+01 2.26211278e+02
1716.lowfreq: -5.6989 -4.2356 0.0006 0.0007 0.0009 6.6559 17.7444 23.3923 28.6971
frequency: 17.7248 23.3075 28.4173 33.6025 39.1440 46.7302 64.2503 71.2086 77.7780 80.4368 94.1302 119.4566 123.3796 134.8312 146.2968 155.8646 184.8521 198.7752 200.8010 213.4654 223.1326 249.6241 257.5676 267.6787 282.4845 301.7324 309.6978 330.5240 341.5307 367.5864 384.2476 396.5350 417.9709 428.3432 440.1787 456.1948 464.9992 478.8135 506.7527 522.3081 536.5152 555.7066 582.2113 582.8638 614.8409 620.8213 641.3421 671.2519 682.4357 686.5660 706.1958 730.0565 738.5630 761.4170 806.4665 809.4176 825.6048 831.0767 846.5202 858.0325 870.2867 891.2069 901.6351 907.7773 935.1632 943.7020 951.6504 954.5873 961.1353 972.6124 984.2435 986.0496 990.8740 1011.9960 1041.6175 1045.4231 1049.2399 1055.0282 1087.3396 1096.6882 1113.9624 1142.0724 1159.2170 1183.7177 1198.6420 1202.4348 1229.3166 1236.9113 1247.0813 1252.9643 1268.6421 1291.3602 1303.1682 1324.6905 1354.8711 1365.5700 1382.4902 1385.1348 1389.6182 1396.3024 1397.5964 1402.2751 1407.3705 1440.3013 1450.7808 1451.5354 1452.5441 1453.5561 1455.1328 1465.3163 1467.1111 1473.6159 1479.5018 1485.1889 1489.5657 1558.8882 1610.2325 1613.7813 1623.1271 1657.7488 1658.3128 1692.3732 2967.8614 2972.9486 2997.2035 3004.1216 3005.3167 3038.0883 3043.5021 3045.4354 3046.1572 3092.5331 3095.5172 3099.1554 3104.7827 3112.5888 3114.4773 3129.2385 3133.3261 3138.8810 3139.3418 3148.5050 3178.1941 3188.5268
redmass: 5.7320 3.2696 2.1923 2.2279 3.5704 3.6968 3.5777 4.8818 1.3190 2.2261 5.6266 4.9170 4.3360 4.8120 1.4889 5.1032 1.2864 2.3281 5.3909 3.4930 1.4346 3.0751 2.6574 4.3656 5.5005 3.8328 5.2041 3.5206 6.6310 3.4829 3.7102 4.0283 3.8056 6.3900 3.1872 4.3819 2.3654 4.1302 4.3884 5.5534 4.9606 3.5508 4.6155 5.1285 6.0436 4.6384 5.9066 6.5751 4.0658 4.1184 7.4950 5.8947 7.3386 6.4237 2.8115 1.9303 6.6354 4.1850 1.5847 5.9051 1.4604 3.8531 3.8375 4.0505 2.7249 1.7956 1.6214 1.3292 3.3085 4.2527 1.2340 1.3437 1.9592 1.4567 1.6692 3.1917 2.8560 2.1899 1.7451 1.7560 1.9272 2.4139 1.3629 3.2115 1.7888 3.3707 1.7441 3.2073 1.8735 1.8420 3.7612 2.4491 1.3255 1.3836 1.5827 1.4758 1.2363 1.2200 1.3587 1.9083 1.2172 1.2126 7.5577 6.2690 1.0703 1.0532 1.0550 1.0564 1.0502 1.0521 1.1068 1.0669 3.6796 1.0469 1.0565 8.8595 7.1493 8.0697 9.5849 8.1317 6.6786 10.8515 1.0386 1.0389 1.0360 1.0358 1.0379 1.0956 1.0835 1.0954 1.0845 1.0990 1.0991 1.0944 1.1003 1.1006 1.1002 1.0971 1.0907 1.0898 1.1024 1.0907 1.0955 1.0952
irintensity: 0.2192 1.7172 0.0817 1.1193 1.2614 1.0078 3.6742 1.2219 1.7579 3.2713 0.3398 0.4932 1.6131 0.8552 1.2331 1.7413 0.5535 0.1630 6.3623 0.2876 1.9360 1.2995 0.5155 3.0225 15.6938 5.2048 2.6861 1.9341 0.6044 1.6277 6.0107 0.8104 0.7158 3.6050 3.5309 2.1714 6.2031 4.4803 13.7290 18.6210 12.8301 1.0388 10.4424 16.0427 19.7109 6.3743 1.4362 3.4427 1.6823 2.4845 3.2900 3.1017 56.5563 15.5412 5.7638 1.1631 35.0569 5.0106 85.7950 4.3135 18.4892 32.9993 56.6023 48.0007 81.8624 66.1845 7.5339 1.1749 74.9184 173.3650 6.4895 0.4447 47.2658 25.8759 11.6354 27.2541 157.5575 345.6154 7.1561 108.4497 127.3904 144.4249 2.6012 314.2435 42.5700 24.7056 6.2154 65.9811 19.9124 91.0405 95.0804 19.1679 16.2194 9.0110 18.4507 22.0383 56.8863 24.1726 46.1200 22.6261 27.8631 21.2015 43.8808 3.3410 41.0881 8.6425 15.1731 15.5494 6.1338 3.0323 63.3280 3.5862 49.6507 30.1846 25.3515 20.9525 34.5418 523.7136 124.5028 33.4307 357.6038 451.7198 5.8411 51.5933 12.2469 17.1961 1.7488 3.9901 11.1227 27.8486 15.0555 11.0992 22.1271 7.3334 22.8902 10.9644 19.6441 1.9653 10.3517 11.9096 8.3738 4.9671 5.2078 2.5456
temp: 298.150 k
press: 1.00000 atm
elementType: 8 8 8 8 8 8 8 6 6 6 6 6 6 6 6 6 6 6 6 6 6 6 6 6 6 6 6 6 1 1 1 1 1 1 1 1 1 1 1 1 1 1 1 1 1 1 1 1 1 1
symmnumber: 1
zpe: 1014542.4 jmol-1
zpe.correction: 0.386419 hartree
zpe.thermalcorrener: 0.414497 hartree
zpe.thermalcorrenthalpy: 0.415442 hartree
zpe.thermalcorrgfe: 0.325236 hartree
zpe.sumelectzpe: -1337.969340 hartree
zpe.sumelectthermal: -1337.941261 hartree
zpe.sumelectthermalent: -1337.940317 hartree
zpe.sumelectthermalfe: -1338.030523 hartree
dipole: 1.1466 -5.3134 0.4151
dipole: 5.4515
quadrupole: -139.2597 -170.5103 -149.2470
quadrupole: 12.2036 -11.8531 11.0704
quadrupole: 13.7460 -17.5046 3.7586 12.2036 -11.8531 11.0704
hfenergy: -1338.3557583 hartree
pointgroup: C01 [X(C21H22O7)]
dipole: 0.2142227 -0.4463013 -2.0868791 debye
polarizability: 329.5124913|-8.6668331|224.9227263|-18.4728059|19.820316|262.50017 unknown
InChI: InChI=1S/C21H22O7/c1-11(2)10-16(24)27-20-19(25-12(3)22)17-14(28-21(20,4)5)8-6-13-7-9-15(23)26-18(13)17/h6-10,19-20H,1-5H3
charge 0 multiplicity 1
50 atoms
O  0.030708 -1.632864 -2.150113
O  1.651336 0.355068 -0.590341
O  -0.590887 -1.543013 1.67029
O  -2.749604 0.53143 1.191116
O  3.734716 -0.059339 0.397709
O  0.513409 -0.196992 3.229347
O  -4.043998 1.514042 2.834153
C  1.070284 -2.007465 -1.111806
C  1.141158 -0.914611 -0.015306
C  -0.224896 -0.549003 0.600006
C  -1.336025 -0.53854 -0.412759
C  -1.152702 -1.050921 -1.72241
C  2.367645 -2.11133 -1.920156
C  0.653014 -3.367656 -0.51434
C  -2.590623 0.036295 -0.104532
C  -2.18646 -0.966402 -2.701453
C  -3.649082 0.120585 -1.055779
C  -3.413252 -0.390496 -2.367107
C  2.995282 0.703984 -0.273832
C  -4.89048 0.72345 -0.636937
C  -0.209706 -1.184271 2.980993
C  -4.010422 1.13494 1.649024
C  -5.064144 1.206049 0.644661
C  3.284418 2.021688 -0.861639
C  -0.823868 -2.131523 3.983981
C  4.470063 2.707676 -0.77193
C  4.601718 4.064826 -1.434734
C  5.699869 2.2183 -0.039031
H  1.838965 -1.245744 0.77532
H  -0.121008 0.430943 1.099652
H  2.565836 -1.169428 -2.456079
H  3.218886 -2.322797 -1.25077
H  2.281613 -2.924064 -2.660948
H  -0.29995 -3.304038 0.034537
H  0.553759 -4.102889 -1.330807
H  1.426528 -3.728079 0.187344
H  -1.989037 -1.366403 -3.699428
H  -4.213048 -0.329478 -3.113834
H  -5.71007 0.794861 -1.361926
H  -6.001545 1.661398 0.97287
H  2.444183 2.463035 -1.408046
H  -0.914778 -3.14758 3.569197
H  -1.840078 -1.772334 4.230494
H  -0.22455 -2.139479 4.906654
H  4.874185 4.835415 -0.687296
H  3.672862 4.380626 -1.937691
H  5.418687 4.052571 -2.182733
H  5.563129 1.214097 0.384897
H  5.950986 2.920921 0.780307
H  6.571269 2.21404 -0.72299
