program: Gaussian 09
title: 000147139
version: EM64L-G09RevD.01
frameworkgroup: C1[X(C8H6N4)]
method: RPBEPBE
basis: SDD
operation: Freq
keyword: #p
keyword: freq=noraman
keyword: PBEPBE/SDD
title: #p freq=noraman PBEPBE/SDD
converged: NO YES NO NO
title: Mulliken charges:
elementType: N N N N C C C C C C C C H H H H H H
charge: -0.460278 -0.004702 0.048652 -0.005688 0.288222 0.193129 -0.218773 -0.327494 -0.501497 -0.144194 -0.372182 -0.146174 0.343628 0.246331 0.292498 0.292566 0.231406 0.244549
chargesum: 0.00000
title: Mulliken charges with hydrogens summed into heavy atoms:
elementType: N N N N C C C C C C C C
charge: -0.116650 -0.004702 0.048652 -0.005688 0.288222 0.193129 -0.218773 -0.081163 0.083567 0.087213 -0.127633 -0.146174
polarizability: 1.61461287e+02 2.63897028e-01 1.06111421e+02 -4.61794264e-02 9.97483021e-03 4.76387032e+01
1716.lowfreq: -4.0909 -0.0006 0.0005 0.0006 1.4999 6.0694 24.2886 95.3763 127.4045
frequency: 24.2753 95.3758 127.3988 239.7001 254.0256 304.7872 356.2839 420.1501 433.2565 481.4903 580.4143 589.9213 627.0696 631.8695 655.1327 690.4274 787.1243 804.7519 810.7439 881.7796 919.6498 934.3159 936.0591 967.4264 978.8761 1028.5078 1110.8596 1183.8363 1189.5728 1218.5232 1269.3231 1285.1644 1308.8874 1356.2579 1368.6394 1397.6529 1436.2180 1452.4087 1522.2361 1549.5183 1618.8039 2206.1350 3006.8783 3056.1641 3137.1143 3148.8443 3174.3273 3560.6239
redmass: 5.0589 9.4142 3.4817 4.8440 7.0937 3.7449 4.1532 9.7496 4.2388 5.1872 9.3327 3.5695 7.4022 1.9054 1.8445 5.7724 1.5612 3.8469 5.4391 6.6838 1.3735 6.3448 2.0056 1.3641 4.2706 2.3744 1.6210 2.4447 1.0946 1.5122 2.7100 2.8293 1.8764 3.6100 5.1639 2.2067 1.1053 2.4750 4.8023 7.2275 7.4385 12.4549 1.0598 1.0993 1.0886 1.0920 1.0993 1.0820
irintensity: 17.9823 8.9182 10.6003 2.8960 2.7875 0.2049 0.5339 0.1241 0.3152 7.2545 0.4243 0.0699 0.1349 55.2453 47.7082 0.1913 68.4335 14.9831 2.2469 3.5819 0.0203 2.8476 2.4603 1.6800 1.3906 1.4671 5.4071 5.5067 0.3894 17.2708 27.7173 29.6100 10.3599 35.1031 89.6020 29.6268 25.2936 6.8816 82.1066 1.2466 3.6564 8.5458 1.6198 0.0343 9.8440 11.0236 20.1531 52.8661
temp: 298.150 k
press: 1.00000 atm
elementType: 7 7 7 7 6 6 6 6 6 6 6 6 1 1 1 1 1 1
symmnumber: 1
zpe: 341646.3 jmol-1
zpe.correction: 0.130126 hartree
zpe.thermalcorrener: 0.139418 hartree
zpe.thermalcorrenthalpy: 0.140362 hartree
zpe.thermalcorrgfe: 0.094236 hartree
zpe.sumelectzpe: -526.616152 hartree
zpe.sumelectthermal: -526.606860 hartree
zpe.sumelectthermalent: -526.605916 hartree
zpe.sumelectthermalfe: -526.652043 hartree
dipole: 0.1752 2.9501 0.0361
dipole: 2.9555
quadrupole: -71.6959 -72.5320 -69.9100
quadrupole: 17.1940 -0.0922 0.0098
quadrupole: -0.3166 -1.1527 1.4693 17.1940 -0.0922 0.0098
hfenergy: -526.7462786 hartree
pointgroup: C01 [X(C8H6N4)]
dipole: 0.1801976 -1.0509265 0.4638425 debye
dipolederiv: -0.6357262 0.0484993 -0.0700569 -0.1603439 -0.4965718 0.0840716 0.0178679 0.1099581 -0.298202 -0.8066036 -0.2079282 0.0205813 -0.073904 -0.3621761 0.0327413 -0.0372489 0.0163453 -0.2749919 -0.2839029 -0.0045567 -0.0060418 -0.0341625 -0.2735195 0.0184308 0.0065755 0.0220636 -0.229405 -0.2724525 0.0114509 -0.0114827 -0.0832737 -0.2215479 -0.0096085 0.0300453 0.0018797 -0.21717 0.2968925 0.0458962 0.0032853 0.4946238 -0.1292387 0.1697417 -0.1910472 0.1129994 0.0445278 0.6592946 0.0778987 0.0438895 0.0551095 0.6147178 -0.2336354 0.0601521 -0.2314057 0.1615755 0.5669715 0.0743408 0.0331664 -0.3809546 0.1030067 -0.0695044 0.2297572 -0.0115598 0.0883928 0.2180792 -0.0344547 0.0621474 -0.021506 0.0955608 -0.1105108 0.056897 -0.1122569 -0.0985515 0.0500971 -0.0433471 -0.000628 0.0361396 0.0473273 0.0749439 -0.0406784 0.0644975 0.1734651 -0.1906354 -0.0327044 0.0053614 -0.2746805 -0.1047673 -0.0426313 0.1097586 -0.0119611 -0.1036389 0.2177217 0.0341048 0.0261009 0.3367677 0.1677363 -0.0734761 -0.104546 -0.1120005 -0.0666849 -0.0257003 0.0905018 -0.0389171 0.2026142 0.1073112 -0.0384759 -0.0869622 -0.0519198 -0.0249381 0.25287 0.0084047 -0.0155034 -0.0084197 0.2000218 0.0621461 -0.0079363 0.0646321 0.316575 0.0863828 -0.0338028 0.0039562 -0.003172 -0.0368259 0.0890117 -0.0092685 0.0851071 0.1324198 0.0191475 -0.0361797 -0.0182834 -0.0720043 0.1073383 0.0060803 -0.0463266 0.0211946 0.0223884 0.0004532 -0.0050066 0.0238932 -0.010242 0.0456767 -0.0327651 0.0703069 -0.0423241 0.1067924 -0.0494091 0.0692445 -0.0574834 0.0765317 0.0672931 0.0530851 -0.060692 0.052145 0.1375593 -0.1034801 -0.0623614 -0.0039851 -0.0791234 0.068657 0.0203551 0.0033457 0.0226055 0.1298861 unknown
polarizability: 159.492115|9.7521266|97.8812988|9.9412312|-20.5838427|57.8379972 unknown
InChI: InChI=1S/C8H6N4/c9-4-3-7-11-6-2-1-5-10-8(6)12-7/h1-2,5,11H,3H2
charge 0 multiplicity 1
18 atoms
N  -0.547641 -0.896651 0.057989
N  -0.266758 1.203265 -0.813081
N  2.190871 1.307662 -0.544957
N  -3.973429 -1.805505 0.034376
C  0.826279 -0.642725 0.123998
C  -1.144694 0.238758 -0.508268
C  0.988726 0.681727 -0.427941
C  1.939365 -1.372765 0.580522
C  -2.633103 0.358417 -0.753155
C  3.185031 -0.7189 0.45665
C  3.261143 0.592438 -0.099558
C  -3.388295 -0.829442 -0.322579
H  -1.038473 -1.738759 0.361696
H  1.85769 -2.378678 1.004256
H  -2.808728 0.537137 -1.830559
H  -3.016016 1.251327 -0.224491
H  4.104817 -1.21143 0.786004
H  4.233316 1.089523 -0.190303
