program: Gaussian 09
title: 000010151
version: EM64L-G09RevD.01
frameworkgroup: C1[X(C15H10O5)]
method: RPBEPBE
basis: SDD
operation: Freq
keyword: #pfreq=noraman
keyword: PBEPBE/SDD
title: #p freq=noraman PBEPBE/SDD
converged: YES YES NO YES
title: Mulliken charges:
elementType: O O O O O C C C C C C C C C C C C C C C H H H H H H H H H H
charge: -0.379359 -0.367214 -0.329846 -0.295818 -0.389309 0.080232 0.232901 0.000055 0.362490 -0.095721 -0.006569 -0.062173 0.156419 0.435952 -0.634910 0.140381 -0.420115 -0.779941 -0.351208 -0.190682 0.231713 0.293680 0.214040 0.253725 0.253652 0.263611 0.240923 0.392849 0.363235 0.387007
chargesum: 0.00000
title: Mulliken charges with hydrogens summed into heavy atoms:
elementType: O O O O O C C C C C C C C C C C C C C C
charge: 0.013490 -0.003979 -0.329846 -0.295818 -0.002302 0.080232 0.232901 0.000055 0.362490 -0.095721 -0.006569 -0.062173 0.156419 0.435952 -0.403197 0.140381 -0.126435 -0.058524 -0.087597 0.050241
polarizability: 3.48258283e+02 -1.39065402e+01 2.18650008e+02 -1.27505685e-03 -1.21096025e-03 7.25245668e+01
1716.lowfreq: 0.0009 0.0009 0.0011 6.1370 8.4804 11.8250 52.7720 59.6445 117.1951
frequency: 52.7703 59.6390 117.1872 118.4886 148.0952 169.0116 179.9265 205.7630 233.0585 263.0454 282.9970 301.0471 310.4210 382.2645 384.0502 401.0879 403.4218 436.2680 440.6443 446.8280 450.7003 475.6885 494.3620 512.9580 547.7770 555.1033 582.3651 614.8661 657.9461 678.7684 718.3953 727.3090 754.7460 782.3341 800.8398 844.8581 859.8939 873.3910 899.1928 928.5063 955.3597 977.9002 996.8445 1005.6491 1013.4044 1045.4808 1052.1477 1080.0644 1099.9411 1170.0931 1185.3182 1198.3620 1239.3523 1272.5057 1280.1964 1296.6272 1313.2149 1327.9674 1365.8922 1391.9026 1402.9656 1416.6426 1423.9422 1443.4198 1449.4497 1451.6348 1458.9141 1476.9484 1542.9585 1551.8539 1575.7818 1603.7625 1607.8905 1625.5994 2515.7884 2626.8228 2989.2354 3068.0512 3100.5776 3106.6159 3145.9157 3171.8886 3180.5235 3533.3846
redmass: 5.6487 5.8827 1.2713 3.3187 8.2018 6.7871 5.3456 5.1552 4.4467 3.5334 5.5072 6.1985 5.8403 3.0647 6.1592 8.7370 1.5008 10.7001 4.3388 8.8606 6.4004 8.3328 4.2134 7.6101 5.0556 7.4334 5.3637 4.8833 4.6278 4.5900 7.0315 3.3119 7.2969 8.5677 2.1181 3.7210 1.4672 8.1685 5.7304 1.4426 5.1867 1.0642 1.3585 1.0630 1.8495 1.5401 2.3601 3.2479 2.4956 1.2818 1.4443 2.4476 1.7517 3.3730 2.3648 4.7128 3.3411 3.9853 7.6650 4.0458 1.3431 7.5042 2.7529 3.4015 1.0443 2.6087 4.5862 1.2919 3.4652 4.9344 4.1648 3.5274 4.5658 6.1806 1.0754 1.0717 1.0367 1.0961 1.1008 1.0916 1.0880 1.0923 1.0985 1.0658
irintensity: 5.6294 0.3989 0.7550 0.0108 0.1763 0.0144 0.5215 0.0002 0.1388 0.0168 1.9486 5.2334 1.8727 12.6378 7.9058 5.5835 105.1399 34.6261 13.2342 5.4156 16.8787 1.4570 7.0926 3.1595 0.0713 2.6578 5.9144 5.0861 0.8919 7.1979 3.9455 5.0925 6.2503 17.7155 51.2627 15.7177 24.5941 16.2539 16.5933 0.0714 57.4447 119.6180 0.6313 127.0485 20.2628 19.5357 1.9360 46.6142 70.8809 39.0778 57.3150 38.6505 48.6236 377.8484 183.2260 62.9914 38.5969 471.7891 20.9799 117.5521 70.2294 75.0093 3.8109 61.6989 14.4293 180.4284 297.4282 52.5374 6.8020 52.3560 66.1178 5.4257 7.8851 40.9030 135.8015 222.9723 16.5922 8.2294 13.0414 27.2844 12.3390 0.8029 12.5405 55.6474
temp: 298.150 k
press: 1.00000 atm
elementType: 8 8 8 8 8 6 6 6 6 6 6 6 6 6 6 6 6 6 6 6 1 1 1 1 1 1 1 1 1 1
symmnumber: 1
zpe: 561256.8 jmol-1
zpe.correction: 0.213771 hartree
zpe.thermalcorrener: 0.229551 hartree
zpe.thermalcorrenthalpy: 0.230495 hartree
zpe.thermalcorrgfe: 0.171442 hartree
zpe.sumelectzpe: -952.373335 hartree
zpe.sumelectthermal: -952.357555 hartree
zpe.sumelectthermalent: -952.356611 hartree
zpe.sumelectthermalfe: -952.415664 hartree
dipole: -3.4617 0.3635 0.0018
dipole: 3.4807
quadrupole: -93.3421 -118.9252 -116.6692
quadrupole: -23.4890 -0.0040 -0.0048
quadrupole: 16.3034 -9.2797 -7.0237 -23.4890 -0.0040 -0.0048
hfenergy: -952.5871063 hartree
pointgroup: C01 [X(C15H10O5)]
dipole: 1.3653813 -0.105102 0.0007735 debye
polarizability: 348.9309444|-10.2838123|217.9773391|0.0142209|0.0289042|72.5245735 unknown
InChI: InChI=1S/C15H10O5/c1-6-5-9(17)11-12(13(6)18)14(19)7-3-2-4-8(16)10(7)15(11)20/h2-5,16-18H,1H3
charge 0 multiplicity 1
30 atoms
O  2.645469 2.365476 0.001052
O  1.630335 -3.140066 -0.000491
O  0.206656 2.806983 0.000243
O  -0.987099 -2.596661 -0.000488
O  -3.443525 -2.097589 -0.000058
C  1.011426 0.540962 0.000057
C  0.732515 -0.875905 -0.000233
C  -1.745518 -0.32953 -0.000112
C  -1.470586 1.073341 0.000069
C  -0.070695 1.532366 -0.000222
C  -0.668927 -1.335994 -0.000548
C  2.358689 1.025928 0.000499
C  1.840935 -1.764621 -0.000181
C  3.465106 0.112521 0.000547
C  3.176088 -1.255687 0.000163
C  -3.115533 -0.767958 0.000092
C  -2.521158 2.015412 0.000415
C  4.87285 0.653235 0.001166
C  -4.165162 0.19219 0.00047
C  -3.864527 1.565877 0.000618
H  4.012295 -1.968606 0.000187
H  -2.271827 3.079865 0.000511
H  5.619987 -0.15742 -0.000437
H  5.042118 1.299482 -0.879265
H  5.04257 1.296229 0.883924
H  -5.196515 -0.172101 0.000627
H  -4.681763 2.294637 0.00089
H  1.717698 2.865225 0.001468
H  2.49688 -3.623615 -0.000439
H  -2.538081 -2.621878 -0.000326
