program: Gaussian 09
title: 000147117
version: EM64L-G09RevD.01
frameworkgroup: C1[X(C17H19Cl2N5O2)]
method: RPBEPBE
basis: SDD
operation: Freq
keyword: #p
keyword: freq=noraman
keyword: PBEPBE/SDD
title: #p freq=noraman PBEPBE/SDD
converged: YES YES NO NO
title: Mulliken charges:
elementType: Cl Cl O O N N N N N C C C C C C C C C C C C C C C C C H H H H H H H H H H H H H H H H H H H
charge: -0.017573 -0.020475 -0.258522 -0.225804 -0.069896 -0.050962 -0.114211 -0.140516 -0.027287 -0.351893 -0.381634 -0.393154 -0.518632 -0.298554 0.377808 -0.528830 0.554834 0.206739 -0.268034 -0.265604 0.430008 -0.382955 -0.387104 -0.769280 -0.040994 -0.587533 0.192318 0.194554 0.234445 0.211743 0.221138 0.223090 0.228104 0.230329 0.218104 0.216567 0.267512 0.301440 0.289508 0.235205 0.251758 0.235649 0.261750 0.258025 0.258820
chargesum: 0.00000
title: Mulliken charges with hydrogens summed into heavy atoms:
elementType: Cl Cl O O N N N N N C C C C C C C C C C C C C C C C C
charge: -0.017573 -0.020475 -0.258522 -0.225804 -0.069896 -0.050962 -0.114211 -0.140516 -0.027287 0.034979 0.064554 0.051074 -0.060200 0.136118 0.377808 -0.261318 0.554834 0.206739 -0.268034 -0.265604 0.430008 -0.081515 -0.097596 -0.046669 -0.040994 0.191063
polarizability: 4.06501127e+02 1.56215536e+01 2.34885703e+02 -2.95325719e+01 6.20760233e+00 1.40973467e+02
1716.lowfreq: -4.8964 -3.2536 -0.0022 -0.0008 0.0014 2.8177 6.3702 12.3951 15.4408
frequency: 5.1525 12.2719 15.3324 20.5455 37.6881 43.3924 55.9328 60.9271 77.8928 80.6499 88.5731 100.1277 115.6122 120.9374 125.2817 131.0879 162.2624 178.1388 195.0905 205.1908 221.9937 231.0268 251.7090 271.5614 283.6636 303.9759 332.5154 345.0026 369.8320 375.0015 418.2797 426.3641 465.8446 482.1573 508.8340 561.6564 592.2198 603.8185 625.8605 641.2416 659.9122 668.4028 708.8904 730.0133 738.5042 742.3753 753.1110 758.8966 762.6202 811.5418 827.2554 833.2847 843.2614 894.7457 904.3333 914.3822 922.7353 930.7149 955.8649 957.9797 964.9656 1000.0141 1008.9564 1009.2364 1038.7050 1047.1072 1051.1854 1070.3232 1080.4833 1097.9293 1113.1828 1125.4627 1137.3456 1140.6965 1144.5530 1186.3143 1194.3391 1208.6132 1224.3946 1233.5490 1249.0728 1268.1077 1279.1952 1290.1586 1291.6250 1298.2462 1333.4162 1340.3666 1350.0371 1356.9090 1370.4279 1389.6208 1398.5193 1405.8922 1412.9552 1432.6660 1439.6834 1456.1637 1460.3895 1467.0559 1467.4486 1469.8645 1478.3774 1478.7374 1480.4965 1489.0021 1516.0577 1542.7914 1591.5973 1607.1965 2956.4946 2970.1573 2980.4791 2990.6411 2991.2637 2999.3757 3002.9510 3018.6843 3028.2977 3037.7064 3062.2931 3071.9553 3072.8444 3108.0298 3114.6961 3146.8774 3175.1285 3177.6444 3236.1645
redmass: 7.2695 4.7906 7.3421 4.8053 5.2114 5.9819 2.1077 2.8348 5.6956 6.5805 7.9427 1.1787 1.8612 1.4631 1.9719 2.7910 6.9341 11.3135 4.2629 4.8547 3.7248 6.6551 2.9407 7.0219 6.7380 7.0908 5.4817 7.9685 3.2231 4.8161 5.0113 4.9872 4.4587 7.9299 5.2390 6.1626 5.0427 4.5565 4.8078 10.3939 5.9730 3.8289 6.1631 1.2976 2.5528 8.2270 7.6539 7.2547 1.2159 3.0844 6.7818 1.6357 1.4344 4.5949 1.4352 1.4903 8.3039 2.7267 1.7858 9.4220 2.2113 2.8529 6.7746 3.3574 4.0824 1.5028 3.3418 2.6138 1.5271 3.0682 3.9493 1.3246 1.7461 10.7882 1.3033 2.5421 1.6153 1.8462 2.7024 1.3146 1.5944 4.1622 1.1770 1.3139 1.1192 1.1650 1.3899 8.2690 6.2183 1.5239 1.6876 1.8406 4.0827 1.8322 2.8352 1.2140 4.0344 1.1425 1.0415 1.0696 1.0455 1.0896 1.1039 1.0486 1.2876 1.1049 8.4268 9.3343 7.0974 7.0372 1.0586 1.0558 1.0617 1.0372 1.0611 1.0623 1.0947 1.0334 1.1064 1.1000 1.1045 1.1051 1.0983 1.0989 1.1027 1.1019 1.0928 1.0938 1.0995
irintensity: 0.5161 4.1395 2.8189 0.7900 2.7329 1.3743 2.3060 1.5263 0.5065 0.2269 0.0691 0.0277 0.3127 0.5551 0.5726 1.1342 0.0568 0.4761 4.9598 0.0691 2.0212 1.6685 4.5735 2.6524 2.8245 1.4344 2.6721 0.6712 1.4136 4.0010 1.5073 0.1724 2.6185 6.8810 0.0442 2.7061 1.0217 3.3962 1.2543 0.9712 5.0678 6.5770 37.0343 5.5755 2.0831 8.7940 61.3002 56.1760 2.7515 6.3116 6.2201 21.5923 17.5509 21.1964 10.5338 21.8206 129.7724 10.1627 6.3023 6.9084 1.3610 7.5994 3.4999 1.8042 16.9204 5.8490 11.0728 7.2030 8.8781 14.9872 1.2731 0.9034 3.4644 15.5185 0.6469 3.2726 1.7174 2.8176 134.9642 45.6817 4.6091 15.7318 0.1470 0.5295 0.2345 1.0104 8.9606 8.2422 20.9467 20.6962 144.7713 13.9933 42.7642 45.9730 186.0741 25.0537 19.2812 6.1844 21.6527 0.1001 16.7978 0.3370 2.6545 18.3195 5.9896 18.2384 5.5856 41.2986 86.8090 0.7387 16.9719 37.9457 3.2427 24.0408 26.4580 39.7673 19.2788 26.1323 5.7080 0.8250 3.3416 83.4499 17.2468 9.0516 10.4133 1.4164 1.7327 1.9017 0.8766
temp: 298.150 k
press: 1.00000 atm
elementType: 17 17 8 8 7 7 7 7 7 6 6 6 6 6 6 6 6 6 6 6 6 6 6 6 6 6 1 1 1 1 1 1 1 1 1 1 1 1 1 1 1 1 1 1 1
symmnumber: 1
zpe: 891783.7 jmol-1
zpe.correction: 0.339662 hartree
zpe.thermalcorrener: 0.366274 hartree
zpe.thermalcorrenthalpy: 0.367219 hartree
zpe.thermalcorrgfe: 0.274963 hartree
zpe.sumelectzpe: -2001.521891 hartree
zpe.sumelectthermal: -2001.495279 hartree
zpe.sumelectthermalent: -2001.494335 hartree
zpe.sumelectthermalfe: -2001.586590 hartree
dipole: -2.4879 0.0967 3.9753
dipole: 4.6906
quadrupole: -125.0203 -174.1243 -167.6187
quadrupole: 50.3748 9.3520 -2.6572
quadrupole: 30.5675 -18.5366 -12.0309 50.3748 9.3520 -2.6572
hfenergy: -2001.8615535 hartree
pointgroup: C01 [X(C17H19Cl2N5O2)]
dipole: 0.9584782 -0.0144129 -1.5769432 debye
polarizability: 405.2850112|-18.5547027|234.9188138|-32.6192173|-8.0506484|142.1564722 unknown
InChI: InChI=1S/C17H19Cl2N5O2/c1-11-8-13(26-22-11)6-4-3-5-7-25-16-14(18)9-12(10-15(16)19)17-20-23-24(2)21-17/h8-10H,3-7H2,1-2H3
charge 0 multiplicity 1
45 atoms
Cl 1.597597 2.912264 0.56476
Cl 1.587007 -2.649814 0.763712
O  0.400947 0.155647 0.987338
O  -7.323516 -1.107128 0.34307
N  -8.712644 -0.914088 0.800294
N  6.758083 -1.034278 -0.278419
N  7.999381 -0.515854 -0.527246
N  6.753074 1.264802 -0.341235
N  8.029585 0.880328 -0.571616
C  -3.073064 -0.013417 -0.610176
C  -4.489884 0.056261 -0.000006
C  -1.967744 0.111853 0.463631
C  -5.597866 -0.06664 -1.082659
C  -0.569696 0.035877 -0.14702
C  -6.985613 -0.050347 -0.515947
C  -8.07297 0.799016 -0.630789
C  1.748683 0.1317 0.637896
C  -9.112425 0.230051 0.193787
C  2.484247 1.33316 0.453396
C  2.477436 -1.083557 0.533494
C  4.554994 0.106145 0.103823
C  3.863101 1.340929 0.195926
C  3.855262 -1.116183 0.274069
C  -10.50513 0.742754 0.435366
C  5.994768 0.102371 -0.165577
C  9.191857 -1.336225 -0.73039
H  -2.955693 0.793132 -1.364042
H  -2.956817 -0.97363 -1.154713
H  -4.619994 -0.754236 0.741731
H  -4.616422 1.011727 0.545938
H  -2.068479 1.07107 1.005697
H  -2.072549 -0.69609 1.212266
H  -5.442873 -1.008285 -1.646384
H  -5.507766 0.762945 -1.808068
H  -0.399811 -0.931933 -0.659191
H  -0.386394 0.867336 -0.856617
H  -8.134879 1.709993 -1.221257
H  4.408414 2.27928 0.064764
H  4.389117 -2.067692 0.205693
H  -11.070054 0.812637 -0.511655
H  -11.047358 0.067128 1.116571
H  -10.482071 1.750893 0.887172
H  10.036758 -0.654215 -0.902006
H  9.054484 -1.992569 -1.604573
H  9.381617 -1.953722 0.161991
