program: Gaussian 09
title: 000147258
version: EM64L-G09RevD.01
frameworkgroup: C1[X(C18H21N3O6)]
method: RPBEPBE
basis: SDD
operation: Freq
keyword: #p
keyword: freq=noraman
keyword: PBEPBE/SDD
title: #p freq=noraman PBEPBE/SDD
converged: YES YES NO NO
title: Mulliken charges:
elementType: O O O O O O N N N C C C C C C C C C C C C C C C C C C H H H H H H H H H H H H H H H H H H H H H
charge: -0.253400 -0.317498 -0.235632 -0.212964 -0.240098 -0.266808 -0.318027 -0.197136 -0.620807 -0.304221 0.291411 -0.223485 -0.407373 -0.226233 0.093614 0.151959 -0.311609 -0.086602 -0.116935 -0.545548 0.114874 0.264571 -0.026156 -0.520630 -0.483785 -0.799075 0.310754 0.269354 0.259841 0.269817 0.251832 0.271224 0.280795 0.232862 0.289774 0.213217 0.235819 0.239341 0.284339 0.239034 0.246480 0.244455 0.251031 0.238028 0.263545 0.233074 0.329898 0.343078
chargesum: 0.00000
title: Mulliken charges with hydrogens summed into heavy atoms:
elementType: O O O O O O N N N C C C C C C C C C C C C C C C C C C
charge: -0.253400 -0.317498 -0.235632 -0.212964 -0.240098 -0.266808 -0.048209 -0.197136 0.052170 -0.034867 0.291411 0.036355 0.115683 0.054562 0.093614 0.151959 0.211027 -0.086602 -0.116935 0.142829 0.114874 0.264571 0.258182 -0.035115 0.011701 -0.064428 0.310754
polarizability: 3.02782602e+02 3.39860997e+01 2.77163734e+02 1.51502450e+01 -9.18433265e+00 1.66777319e+02
1716.lowfreq: -5.6517 -0.0008 -0.0006 -0.0004 3.5232 5.6246 18.7089 27.0881 33.3783
frequency: 18.6697 27.0740 33.3280 35.1047 43.5123 49.6157 71.5366 85.5039 98.1700 108.0630 119.7433 122.5293 131.8157 150.5247 156.8593 169.1654 182.2660 198.8005 220.0604 227.0633 240.7211 267.7373 282.9481 301.0505 313.2201 320.3267 336.8816 363.2391 397.6578 398.2656 410.3968 436.1042 450.3981 472.7224 487.7178 489.1800 500.3127 505.2038 515.1432 553.3674 570.7223 616.3409 634.8962 668.6660 703.5508 710.8615 724.9054 730.4940 731.5457 752.7760 777.4023 791.8123 797.8749 811.3264 814.8492 840.8204 876.3487 892.3510 911.1837 936.2282 946.8034 952.0897 959.8452 971.8936 988.9916 1003.0994 1011.1281 1034.4340 1038.4582 1040.9757 1052.0656 1056.6566 1057.8102 1072.0850 1080.0075 1085.6322 1108.4271 1116.8966 1119.7727 1120.2261 1128.6528 1150.6076 1156.4561 1175.3005 1188.2821 1198.2662 1204.6469 1212.2372 1220.2919 1236.2919 1247.1925 1286.0171 1292.6983 1297.8498 1311.3606 1321.6806 1334.3527 1339.6829 1371.1407 1377.5831 1393.8256 1429.0282 1435.8345 1456.0646 1458.8925 1462.6789 1467.7846 1469.4971 1474.9972 1480.4629 1484.7084 1511.7207 1542.4017 1549.0563 1590.0409 1596.4647 1693.6651 2958.6784 2987.9064 3012.8770 3015.6806 3031.4064 3045.2582 3063.2934 3094.1670 3100.7478 3104.2132 3107.8924 3110.1476 3111.4099 3167.7735 3189.1609 3192.8214 3205.9762 3223.9360 3322.3680 3559.4801 3716.4112
redmass: 5.9953 5.2768 3.5334 5.4848 4.9186 4.9787 4.4830 5.9180 2.8712 1.3247 3.2293 3.3012 4.4310 3.7509 2.1483 5.7759 3.7324 1.7979 5.0416 3.2882 4.7294 3.8804 3.4931 4.3131 5.5081 3.9357 3.0822 5.2261 5.0763 5.6607 3.7730 4.4338 3.7400 8.6792 1.2366 4.6691 4.1207 1.0860 5.2244 5.1880 6.1510 3.6465 5.3670 4.6116 10.8290 4.5324 4.0095 3.7791 3.7954 1.9574 3.5893 3.2706 6.0394 2.5055 1.5101 4.9908 3.5143 3.4510 2.5166 2.9649 1.5073 3.7862 3.0543 2.8986 5.6443 3.7856 3.5271 2.2625 1.2093 1.4570 1.2383 2.5257 2.4343 1.9871 1.7656 1.4243 2.1001 1.6881 1.4175 1.8327 1.5456 1.6942 1.3486 1.7635 2.4108 1.3730 1.8958 1.4706 1.6409 1.5388 4.0673 1.9056 2.1143 1.6452 1.4554 2.5413 1.9927 2.1035 1.8159 6.2227 1.2638 1.0890 1.1262 1.5113 1.8388 1.0590 1.2966 1.0512 1.4007 1.0816 1.0523 10.2118 10.6014 8.6599 1.2112 9.5886 7.5939 1.0320 1.0370 1.0821 1.0634 1.0582 1.1030 1.0969 1.1010 1.1084 1.0513 1.1004 1.0993 1.0617 1.0916 1.0948 1.0941 1.1176 1.1132 1.0757 1.0445 1.1058
irintensity: 1.2968 0.8226 1.8554 2.2556 3.6237 0.4858 0.6137 2.6499 1.8826 0.3158 2.0812 2.2019 0.3852 3.7512 8.2190 10.4274 0.5868 3.9750 1.6792 4.6172 4.5256 1.6121 1.1608 2.1449 2.7355 1.2518 6.9269 14.6907 6.1587 16.9496 6.4023 4.3924 6.1796 1.4014 248.1238 9.6073 6.1760 32.9965 7.5657 6.9118 15.2181 3.2238 5.7847 14.4783 24.5340 26.5149 29.7213 25.7010 3.3175 8.8658 18.1244 15.2346 1.3742 13.4746 14.4259 43.9235 15.8081 31.8804 1.5850 14.4742 3.1505 11.7057 0.5123 123.5572 88.0423 85.9088 159.1111 20.6719 37.0362 1.0722 9.1019 62.8916 14.6560 30.1499 12.8768 7.1511 33.0611 15.9455 7.4271 49.1999 26.7047 12.7548 0.4349 13.9653 34.2367 46.3338 45.1104 19.3304 39.2379 65.3956 190.5943 36.9294 340.5205 106.8576 28.5710 104.6504 25.1647 1.1250 36.7196 65.2281 35.6229 10.8258 9.2621 18.9620 147.8402 5.2473 32.5245 16.8134 35.4164 10.8139 17.6907 179.1009 435.3662 86.9407 117.4000 61.7582 329.0578 64.4707 20.7875 1.8880 23.7474 10.2316 37.3356 15.5999 2.5797 7.6464 12.7031 23.5278 2.9580 4.7889 16.0238 13.3084 3.1039 0.5095 18.9660 5.1995 60.0872 49.8306
temp: 298.150 k
press: 1.00000 atm
elementType: 8 8 8 8 8 8 7 7 7 6 6 6 6 6 6 6 6 6 6 6 6 6 6 6 6 6 6 1 1 1 1 1 1 1 1 1 1 1 1 1 1 1 1 1 1 1 1 1
symmnumber: 1
zpe: 976592.8 jmol-1
zpe.correction: 0.371965 hartree
zpe.thermalcorrener: 0.398429 hartree
zpe.thermalcorrenthalpy: 0.399373 hartree
zpe.thermalcorrgfe: 0.313335 hartree
zpe.sumelectzpe: -1311.999192 hartree
zpe.sumelectthermal: -1311.972728 hartree
zpe.sumelectthermalent: -1311.971784 hartree
zpe.sumelectthermalfe: -1312.057821 hartree
dipole: 2.6171 -0.7308 3.5011
dipole: 4.4318
quadrupole: -124.0121 -162.4602 -164.4704
quadrupole: 2.2144 14.1583 -8.7745
quadrupole: 26.3022 -12.1460 -14.1561 2.2144 14.1583 -8.7745
hfenergy: -1312.3711569 hartree
pointgroup: C01 [X(C18H21N3O6)]
dipole: -1.0214475 0.2495093 1.390892 debye
polarizability: 299.588664|34.9713303|279.9484214|-17.3922611|7.8352654|167.1865702 unknown
InChI: InChI=1S/C18H21N3O6/c1-7-13(22)12-11(14(23)15(7)27-8-3-4-8)9(6-26-17(19)24)18(25-2)16-10(20-16)5-21(12)18/h8-10,16,20H,3-6,19H2,1-2H3
charge 0 multiplicity 1
48 atoms
O  -2.181565 -1.219028 1.963802
O  -3.047324 1.834907 -0.078082
O  3.948982 0.851563 -0.621091
O  1.645144 -3.315244 -0.661763
O  1.400962 2.175603 -0.032535
O  -3.359462 3.149606 -2.012297
N  -2.774377 -1.629204 -1.82205
N  -0.813693 -1.944805 0.186879
N  -4.969866 3.037077 -0.306251
C  -3.027261 -1.335524 -0.354921
C  -1.8494 -0.936672 0.550605
C  -2.77023 -2.765746 -0.820879
C  -1.405789 -3.219355 -0.27253
C  -1.119705 0.455554 0.403951
C  0.385536 -1.335364 -0.088974
C  0.308823 0.04536 0.053452
C  -1.716534 1.436721 -0.613355
C  1.643816 -2.045987 -0.491141
C  1.45622 0.893685 -0.116553
C  -3.313771 -0.450853 2.507994
C  2.75941 0.167609 -0.445875
C  2.836832 -1.207491 -0.656845
C  4.147875 2.254356 -0.254595
C  5.604966 2.619326 -0.056517
C  4.646869 2.544669 1.15686
C  4.139144 -1.874086 -1.034222
C  -3.76846 2.724901 -0.906382
H  -4.018748 -0.94176 -0.130343
H  -3.565095 -3.505445 -0.936832
H  -1.810767 -1.378417 -2.123667
H  -1.543885 -3.911652 0.577769
H  -0.745604 -3.698253 -1.01349
H  -1.137726 0.946561 1.395253
H  -1.852442 0.994883 -1.615466
H  -1.074253 2.328964 -0.698141
H  -4.284436 -0.853816 2.158586
H  -3.247533 0.622004 2.243143
H  -3.244052 -0.573212 3.60013
H  3.443551 2.937809 -0.727844
H  5.941865 3.595821 -0.414289
H  6.336501 1.812203 -0.154634
H  4.772511 1.692751 1.831423
H  4.303663 3.465742 1.634868
H  4.538512 -1.463286 -1.97933
H  3.98287 -2.958203 -1.147915
H  4.912345 -1.699469 -0.263734
H  -5.212016 2.661658 0.606897
H  -5.600207 3.671135 -0.788768
