program: Gaussian 09
title: 000147021
version: EM64L-G09RevD.01
frameworkgroup: C1[X(C10H20O)]
method: RPBEPBE
basis: SDD
operation: Freq
keyword: #pfreq=noraman
keyword: PBEPBE/SDD
title: #p freq=noraman PBEPBE/SDD
converged: YES YES NO NO
title: Mulliken charges:
elementType: O C C C C C C C C C C H H H H H H H H H H H H H H H H H H H H
charge: -0.456511 -0.037183 -0.115573 -0.057731 -0.540674 -0.477355 -0.084181 -0.443094 -0.773775 -0.727961 -0.735552 0.210157 0.245245 0.241203 0.224584 0.211271 0.214397 0.212010 0.197932 0.205572 0.207017 0.214829 0.213440 0.220667 0.208550 0.209249 0.227271 0.205905 0.209511 0.231736 0.339041
chargesum: 0.00000
title: Mulliken charges with hydrogens summed into heavy atoms:
elementType: O C C C C C C C C C C
charge: -0.117469 0.172974 0.129672 0.183472 -0.104819 -0.050948 0.113751 -0.030504 -0.124838 -0.082891 -0.088400
polarizability: 1.18887422e+02 4.45966445e-01 1.07814260e+02 -7.65686783e-01 2.17057861e-01 9.81357159e+01
1716.lowfreq: -9.6779 -0.0008 -0.0007 -0.0006 7.0263 11.1495 31.3976 68.7909 98.8798
frequency: 28.2854 68.6297 98.7901 117.4799 152.7016 186.7157 206.8710 215.2778 233.7374 242.1037 279.8463 294.7944 333.7974 360.3532 368.3052 433.8793 482.0441 489.0093 622.4002 676.6745 765.7734 809.4654 828.7517 870.9282 885.6410 911.6812 938.3252 952.5778 971.6087 975.3615 992.1528 997.2795 1018.6690 1043.2475 1059.1893 1098.7607 1129.1914 1139.9758 1156.4985 1170.7937 1180.7060 1188.8042 1220.2467 1224.9449 1230.9166 1258.7392 1288.3217 1289.8436 1296.8291 1310.8152 1313.0126 1324.5161 1344.7537 1360.5740 1374.8975 1384.8491 1394.6056 1404.1343 1466.4961 1468.2062 1470.9011 1474.5783 1476.5823 1478.2965 1482.9606 1487.5423 1490.7551 2934.5764 2939.8165 2955.8870 2966.2039 2966.9564 2970.3456 2975.4368 2989.8374 2996.5197 3015.7314 3020.9437 3040.2599 3056.4151 3059.0238 3062.1935 3064.3299 3068.8341 3069.8787 3076.0498 3566.5724
redmass: 2.1097 3.2566 2.5633 3.0947 2.8959 2.6649 1.1670 1.4907 1.1573 1.2038 1.1339 3.0804 2.3387 2.3339 2.7173 2.5658 2.6304 3.2273 2.2806 3.2851 2.3933 1.4141 2.5352 2.2466 2.3425 1.1767 1.7419 1.4205 2.0681 3.6301 1.7664 1.5973 1.8303 1.5890 1.8692 2.6345 1.7636 1.7572 2.3843 1.4874 1.6358 1.2313 1.3660 1.4315 1.3102 1.3508 1.2938 1.3334 1.3820 1.4181 1.4002 1.3056 1.5009 1.4629 1.2130 1.2065 1.2220 1.4232 1.0605 1.0472 1.0638 1.0678 1.0569 1.0506 1.0559 1.0620 1.0784 1.0706 1.0657 1.0844 1.0360 1.0358 1.0366 1.0643 1.0988 1.0644 1.0896 1.0884 1.0983 1.0991 1.0996 1.0999 1.0986 1.0994 1.0992 1.0986 1.0666
irintensity: 0.0457 1.8330 0.2882 4.9541 1.6490 3.6439 3.1362 9.0973 2.7878 3.8186 122.8616 2.4625 0.7669 2.0752 2.3832 0.1410 11.9531 1.4642 0.4803 1.5702 0.9014 3.6040 8.7745 11.7498 3.9568 4.2551 10.1115 0.7787 17.4167 49.9533 5.2312 2.0135 7.6397 9.9233 8.9073 1.8214 2.6009 6.8938 5.7274 6.1026 11.0247 2.9846 4.3521 1.0237 8.4644 7.2846 6.0125 2.1375 2.1440 5.0610 1.2633 2.4089 2.7081 0.6926 20.0181 15.6910 17.8660 0.1364 3.4480 2.2139 12.2079 1.5872 3.2412 10.0183 14.5697 12.1196 5.6944 18.5798 27.1255 31.7686 34.0554 32.1092 42.3030 55.4106 25.3140 61.8407 54.2261 7.4875 12.4151 3.0594 32.5225 61.5640 95.5554 20.8740 92.8261 48.3532 1.7653
temp: 298.150 k
press: 1.00000 atm
elementType: 8 6 6 6 6 6 6 6 6 6 6 1 1 1 1 1 1 1 1 1 1 1 1 1 1 1 1 1 1 1 1
symmnumber: 1
zpe: 736248.9 jmol-1
zpe.correction: 0.280422 hartree
zpe.thermalcorrener: 0.293761 hartree
zpe.thermalcorrenthalpy: 0.294705 hartree
zpe.thermalcorrgfe: 0.240907 hartree
zpe.sumelectzpe: -467.353864 hartree
zpe.sumelectthermal: -467.340526 hartree
zpe.sumelectthermalent: -467.339582 hartree
zpe.sumelectthermalfe: -467.393380 hartree
dipole: 1.0568 0.4370 -1.3153
dipole: 1.7429
quadrupole: -74.3269 -67.4139 -69.0537
quadrupole: 0.7712 2.4742 -4.8257
quadrupole: -4.0621 2.8510 1.2111 0.7712 2.4742 -4.8257
hfenergy: -467.6342866 hartree
pointgroup: C01 [X(C10H20O1)]
dipole: -0.4220079 -0.1577929 -0.5169377 debye
polarizability: 118.90667|0.3362223|107.8125987|0.5785422|-0.0287638|98.1181292 unknown
InChI: InChI=1S/C10H20O/c1-7(2)9-5-4-8(3)10(9)6-11/h7-11H,4-6H2,1-3H3
charge 0 multiplicity 1
31 atoms
O  1.909806 -2.356038 -0.46952
C  -0.653042 0.437949 0.154899
C  0.602841 -0.478701 0.315621
C  1.79832 0.515992 0.190811
C  -0.234762 1.426927 -0.975231
C  1.315964 1.580647 -0.856432
C  -2.019889 -0.264303 -0.069616
C  0.684454 -1.580521 -0.753077
C  2.163008 1.158724 1.5491
C  -2.357345 -1.240304 1.084788
C  -3.15774 0.774083 -0.230066
H  -0.745422 1.017212 1.099868
H  0.614809 -0.9817 1.301307
H  2.686151 -0.030099 -0.177173
H  -0.755063 2.396666 -0.88594
H  -0.5150 1.005495 -1.961606
H  1.803225 1.424289 -1.836553
H  1.593238 2.598512 -0.524708
H  -1.963685 -0.84575 -1.015589
H  0.733966 -1.136974 -1.771303
H  -0.203248 -2.2441 -0.700534
H  2.993813 1.880087 1.433696
H  1.305498 1.70749 1.984297
H  2.481176 0.390775 2.27859
H  -2.4232 -0.693402 2.04559
H  -3.331722 -1.734775 0.912261
H  -1.593154 -2.029803 1.20214
H  -3.232099 1.410821 0.673268
H  -4.133483 0.272096 -0.369785
H  -2.989267 1.435584 -1.098379
H  1.986451 -3.096678 -1.121927
