program: Gaussian 09
title: 000147017
version: EM64L-G09RevD.01
frameworkgroup: C1[X(C4H3Cl2NOS)]
method: RPBEPBE
basis: SDD
operation: Freq
keyword: #p
keyword: freq=noraman
keyword: PBEPBE/SDD
title: #p freq=noraman PBEPBE/SDD
converged: NO NO NO NO
title: Mulliken charges:
elementType: Cl Cl S O N C C C C H H H
charge: 0.049005 0.077103 0.494986 -0.243152 -0.516461 0.400238 -0.027212 -0.584359 -0.427886 0.244405 0.244415 0.288918
chargesum: 0.00000
title: Mulliken charges with hydrogens summed into heavy atoms:
elementType: Cl Cl S O N C C C C
charge: 0.049005 0.077103 0.494986 -0.243152 -0.516461 0.400238 -0.027212 0.193379 -0.427886
polarizability: 1.14233557e+02 -1.58138339e+00 1.11963433e+02 -8.45483731e-03 -1.38024153e-03 3.70629016e+01
1716.lowfreq: 0.0011 0.0013 0.0022 8.1057 9.1058 11.0310 99.5495 104.0496 128.5413
frequency: 99.5486 104.0421 128.5382 157.7118 205.5875 215.6908 243.1662 298.0535 361.2833 387.7432 443.9137 464.9210 517.9253 696.5753 706.7754 797.7295 896.2911 938.1545 1121.2482 1129.3788 1158.4643 1294.9363 1415.1526 1469.8628 1478.6442 1568.9185 1613.0716 2984.5863 3076.6868 3102.4310
redmass: 4.8624 6.8705 1.1230 30.1621 6.3717 7.1717 13.2404 4.3550 19.0326 22.9372 7.3293 11.7020 17.3113 12.1641 7.0314 7.8347 8.3794 5.2586 1.2757 3.9256 3.5234 5.6069 1.1492 1.0437 1.0619 12.0457 10.8735 1.0322 1.1038 1.0997
irintensity: 1.7780 5.0608 0.5283 0.0938 4.0229 0.9270 0.0490 7.0546 3.1741 1.1779 11.2754 7.6409 0.4845 9.9424 0.1222 51.5101 51.9385 29.3371 0.0424 55.1689 10.8185 70.5890 33.0587 22.8010 7.4974 44.7562 247.3550 44.3093 24.7847 2.0581
temp: 298.150 k
press: 1.00000 atm
elementType: 17 17 16 8 7 6 6 6 6 1 1 1
symmnumber: 1
zpe: 173919.3 jmol-1
zpe.correction: 0.066242 hartree
zpe.thermalcorrener: 0.075764 hartree
zpe.thermalcorrenthalpy: 0.076708 hartree
zpe.thermalcorrgfe: 0.030376 hartree
zpe.sumelectzpe: -1601.671444 hartree
zpe.sumelectthermal: -1601.661923 hartree
zpe.sumelectthermalent: -1601.660978 hartree
zpe.sumelectthermalfe: -1601.707311 hartree
dipole: -1.2263 -3.9609 0.0001
dipole: 4.1464
quadrupole: -64.6121 -78.4193 -73.1354
quadrupole: 6.6255 -0.0005 -0.0008
quadrupole: 7.4435 -6.3637 -1.0798 6.6255 -0.0005 -0.0008
hfenergy: -1601.7376863 hartree
pointgroup: C01 [X(C4H3Cl2N1O1S1)]
dipole: -0.3551737 1.5921655 -0.0000204 debye
dipolederiv: -0.1767222 0.3185518 -0.0000517 0.2264378 -0.3975092 0.0000575 -0.0000504 0.0000577 0.0297662 -0.68851 -0.2196178 -0.0000819 -0.1961053 -0.1199676 -0.0000174 -0.0001084 -0.0000506 0.0522035 -0.1712145 0.1280739 -0.0000458 0.1059975 -0.372012 -0.0000041 -0.0000185 0.0000315 0.2433132 -0.6248021 -0.4108053 -0.0000728 -0.2801075 -1.0162167 -0.0001114 -0.0000086 0.0000299 -0.3340796 -0.4611126 0.5490855 -0.000007 0.2980053 -0.2598043 0.0000221 -0.0000468 -0.0000084 -0.3554782 0.7947591 0.3695045 0.0001026 0.2413153 1.1223103 0.000145 0.0001226 0.0000632 0.260123 -0.2927618 -0.8787023 0.0000282 -0.4723398 0.298576 -0.0001109 -0.0000507 -0.0001476 -0.0549702 0.4817084 -0.1857934 -0.000035 -0.2437789 0.01947 -0.000026 -0.0000512 -0.0000505 0.2624748 1.030921 0.2341368 0.0001379 0.2082564 0.6198058 0.0000253 0.0001459 0.0000568 -0.1469966 0.0117093 0.0431811 -0.0056182 0.1087013 0.0425216 0.1026287 -0.0733451 0.0970329 -0.0533218 0.0116616 0.0432069 0.005644 0.108665 0.0425856 -0.1025643 0.0734069 -0.0969899 -0.0534031 0.0843638 0.0091785 -0.0000003 -0.1050472 0.0202406 -0.0000445 0.0000043 -0.0000251 0.1503688 unknown
polarizability: 114.4730728|1.378287|111.723917|0.008316|-0.0020577|37.0629016 unknown
InChI: InChI=1S/C4H3Cl2NOS/c1-7-4(8)2(5)3(6)9-7/h1H3
charge 0 multiplicity 1
12 atoms
Cl 1.749311 -2.055852 0.000265
Cl 2.871668 1.259416 0.00022
S  -0.139315 1.919659 -0.000176
O  -1.43943 -1.800845 -0.00026
N  -1.322907 0.549227 -0.000234
C  -0.752242 -0.741235 -0.000295
C  0.728531 -0.598905 0.000005
C  -2.766857 0.807976 -0.000248
C  1.187103 0.685489 -0.000016
H  -3.077008 1.362337 -0.90395
H  -3.077089 1.361936 0.903674
H  -3.253565 -0.182103 -0.000486
