program: Gaussian 09
title: 000147053
version: EM64L-G09RevD.01
frameworkgroup: C1[X(C13H15N2O2)]
method: RPBEPBE
basis: SDD
operation: Freq
keyword: #p
keyword: freq=noraman
keyword: PBEPBE/SDD
title: #p freq=noraman PBEPBE/SDD
converged: YES YES NO NO
title: Mulliken charges:
elementType: O O N N C C C C C C C C C C C C C H H H H H H H H H H H H H H H
charge: -0.215042 -0.253116 -0.100609 -0.103345 -0.487624 0.028025 -0.146445 0.133384 0.330021 -0.137501 -0.592965 -0.452565 -0.340175 0.344669 -0.225916 -0.336543 -0.533232 0.267479 0.293487 0.335522 0.300643 0.300983 0.258613 0.275920 0.282012 0.301911 0.231003 0.246365 0.266238 0.232116 0.232002 0.264683
chargesum: 1.00000
title: Mulliken charges with hydrogens summed into heavy atoms:
elementType: O O N N C C C C C C C C C C C C C
charge: -0.215042 -0.253116 -0.100609 -0.103345 0.073341 0.363548 0.154199 0.133384 0.330021 0.163482 0.223581 -0.150653 -0.109171 0.344669 0.020449 -0.070305 0.195569
polarizability: 2.55137175e+02 -8.31372671e+00 1.52324635e+02 4.93972207e+00 1.02002622e+00 8.85698588e+01
1716.lowfreq: -12.7801 -0.0008 -0.0006 0.0002 2.1134 3.2878 26.2011 32.4899 49.8041
frequency: 26.0114 32.3476 49.8031 66.0319 74.4118 93.9749 134.0127 157.0337 196.2838 208.6457 224.4084 250.9941 264.3567 274.4735 332.0707 399.4308 413.0118 422.2115 488.1557 500.6457 545.0374 597.6988 613.4337 619.4828 628.1071 657.1654 682.6241 715.7624 733.6976 775.9427 783.5232 804.2928 821.1643 859.4873 885.1196 918.3003 958.4049 966.1336 980.0543 980.7155 1004.8429 1019.6526 1036.2486 1079.9321 1100.8572 1108.5486 1110.6123 1127.4476 1151.3095 1162.0098 1178.8073 1188.3751 1208.9584 1261.3582 1274.3778 1295.7354 1297.3033 1331.0356 1367.6408 1389.6444 1405.8396 1428.1419 1436.2973 1441.9915 1459.0364 1468.0195 1469.5100 1470.7505 1478.2965 1484.1879 1543.4232 1558.5136 1573.1134 1588.4902 1615.2579 2975.7452 3021.2511 3023.7361 3071.5522 3102.2683 3125.5447 3141.7198 3144.1251 3145.7482 3161.1201 3174.6644 3178.5590 3257.1592 3280.2417 3295.4470
redmass: 4.9999 3.8179 3.5993 1.1348 3.7079 3.8708 4.5377 3.5969 1.5739 4.9551 3.3987 2.0862 3.2121 3.0066 5.5069 2.8257 3.4448 5.8989 5.4711 3.3797 4.9828 4.2960 3.8813 2.9673 3.2034 5.1835 1.9531 5.3558 1.2945 1.7364 1.5632 3.3912 4.6180 1.4104 1.4629 1.5003 3.6224 3.2649 5.6468 1.3666 3.6140 3.2715 2.2713 1.5004 1.7213 1.2644 1.2585 1.3371 1.4028 1.8800 1.5997 1.2549 1.4907 1.8942 1.6607 1.4236 1.7332 5.4205 3.2378 3.3204 7.6141 1.7603 1.2679 1.6071 1.3047 1.1022 1.0382 1.0503 2.1057 1.1024 3.3623 3.8070 5.6338 7.8375 6.8991 1.0327 1.0634 1.0337 1.1050 1.1000 1.1041 1.1031 1.0870 1.1001 1.0924 1.0924 1.0978 1.0942 1.1098 1.1062
irintensity: 3.3608 0.5625 5.2306 0.2829 7.2248 1.8927 9.7048 0.4814 1.6269 5.0681 4.9801 1.4694 4.9326 3.1410 8.9653 0.6651 1.5464 0.9624 5.8848 3.7777 3.8476 6.7892 4.0697 19.7767 19.5718 11.3091 33.2860 17.1423 33.3099 18.3913 85.5308 5.3992 28.1999 0.4268 6.0017 21.1474 73.8191 26.2256 38.3208 0.6337 0.5980 17.1053 0.9802 13.7569 6.7760 15.7424 0.0799 1.2487 2.1262 81.7053 28.2279 18.4490 3.3348 177.3623 148.7923 68.9313 85.0599 3.3081 6.4039 3.1331 12.9612 102.5163 6.9538 66.7880 24.9238 8.9644 24.3512 17.9759 37.3789 22.6013 35.9464 24.1326 98.2869 221.9418 41.5291 45.6600 12.6573 8.0195 34.5309 0.3211 2.9768 2.1608 3.5197 13.1689 10.8391 2.4872 7.7718 11.3116 21.3049 13.8677
temp: 298.150 k
press: 1.00000 atm
elementType: 8 8 7 7 6 6 6 6 6 6 6 6 6 6 6 6 6 1 1 1 1 1 1 1 1 1 1 1 1 1 1 1
symmnumber: 1
zpe: 677977.0 jmol-1
zpe.correction: 0.258228 hartree
zpe.thermalcorrener: 0.274446 hartree
zpe.thermalcorrenthalpy: 0.275390 hartree
zpe.thermalcorrgfe: 0.212506 hartree
zpe.sumelectzpe: -762.852628 hartree
zpe.sumelectthermal: -762.836410 hartree
zpe.sumelectthermalent: -762.835466 hartree
zpe.sumelectthermalfe: -762.898350 hartree
dipole: 8.8908 2.7270 -0.6518
dipole: 9.3224
quadrupole: 15.5499 -84.2672 -94.4726
quadrupole: -8.7161 0.8485 3.7873
quadrupole: 69.9465 -29.8706 -40.0760 -8.7161 0.8485 3.7873
hfenergy: -763.1108563 hartree
pointgroup: C01 [X(C13H15N2O2)]
dipole: 3.4783816 -1.1594838 -0.0933228 debye
polarizability: 255.4165664|7.6037177|145.4710544|-2.249028|19.4154812|95.1440481 unknown
InChI: InChI=1S/C13H15N2O2/c1-14-6-7-15(10-14)9-13(16)11-4-3-5-12(8-11)17-2/h3-8,10H,9H2,1-2H3
charge 1 multiplicity 1
32 atoms
O  0.68144 1.089181 0.463525
O  -4.325061 1.570662 0.299012
N  2.626353 -0.752631 -0.064923
N  4.462531 0.420882 0.307806
C  1.245184 -1.247313 0.055453
C  3.227397 0.11929 0.797807
C  3.498489 -0.993584 -1.141134
C  0.230441 -0.065789 0.215993
C  -1.2104 -0.383334 0.10544
C  4.648626 -0.261413 -0.906604
C  5.437755 1.340384 0.93469
C  -2.128697 0.68793 0.244907
C  -1.688238 -1.709561 -0.12437
C  -3.519485 0.449459 0.152301
C  -3.073842 -1.935542 -0.209205
C  -3.995617 -0.87133 -0.076151
C  -5.785594 1.40097 0.211107
H  1.016059 -1.841134 -0.843182
H  1.15655 -1.914354 0.932828
H  2.792546 0.516553 1.706917
H  3.241387 -1.65117 -1.965578
H  5.558659 -0.174738 -1.491887
H  5.040105 1.698037 1.895805
H  6.387781 0.812549 1.113096
H  5.611459 2.205668 0.2756
H  -1.765691 1.704458 0.422401
H  -1.005926 -2.559286 -0.229001
H  -3.45162 -2.948197 -0.382071
H  -5.067229 -1.077042 -0.150207
H  -6.15612 0.731725 1.010001
H  -6.080668 1.012659 -0.781621
H  -6.193974 2.410811 0.352347
