program: Gaussian 09
title: 000146986
version: EM64L-G09RevD.01
frameworkgroup: C1[X(C8H5Cl3O3)]
method: RPBEPBE
basis: SDD
operation: Freq
keyword: #p
keyword: freq=noraman
keyword: PBEPBE/SDD
title: #p freq=noraman PBEPBE/SDD
converged: YES YES NO NO
title: Mulliken charges:
elementType: Cl Cl Cl O O O C C C C C C C C H H H H H
charge: 0.049333 0.038424 -0.001254 -0.224294 -0.424007 -0.178586 0.503735 -0.314714 -0.327019 -0.033416 -0.221882 -0.112196 -0.340994 0.164080 0.259667 0.261461 0.253553 0.253632 0.394476
chargesum: 0.00000
title: Mulliken charges with hydrogens summed into heavy atoms:
elementType: Cl Cl Cl O O O C C C C C C C C
charge: 0.049333 0.038424 -0.001254 -0.224294 -0.029531 -0.178586 0.503735 -0.314714 -0.067352 -0.033416 0.039580 -0.112196 0.166191 0.164080
polarizability: 1.83790794e+02 2.41631887e+00 1.41691337e+02 5.70550942e-02 -9.95565276e-03 5.06748684e+01
1716.lowfreq: -0.3422 -0.0034 -0.0020 0.0010 4.5877 5.7855 23.9677 33.9959 72.1569
frequency: 23.9586 33.9947 72.1568 79.0050 122.4645 129.3147 181.0571 201.2128 202.2928 235.5466 238.8577 324.6837 329.1902 375.0243 452.3011 471.1545 500.9826 515.8751 557.3891 576.1877 582.1537 628.1397 678.3258 725.3800 740.1458 793.3433 854.9947 880.4294 919.7720 1006.2274 1008.4142 1041.9182 1066.2040 1157.7089 1166.5362 1209.0039 1248.4810 1266.1133 1351.0851 1372.9804 1384.7793 1432.8243 1456.3695 1558.4966 1584.5757 1710.3305 2970.3450 3029.7952 3164.4163 3183.3923 3528.3043
redmass: 14.3682 8.6378 10.6096 19.7007 5.4327 3.1048 18.4965 17.1508 19.4782 6.5478 10.8054 7.5817 26.8255 10.1078 7.2260 9.6316 3.9808 1.8262 6.2844 4.9683 5.4445 1.5164 9.2486 5.1395 9.5366 1.5156 8.2457 4.0889 1.3524 1.8619 5.8046 4.4300 4.1214 1.6792 1.8399 1.0748 2.2516 2.3231 4.6802 4.4263 2.0598 2.1330 1.2564 7.6636 7.5486 9.4754 1.0554 1.1044 1.0879 1.0969 1.0644
irintensity: 0.6948 0.0056 0.8011 0.2496 0.0024 11.0782 0.1400 0.2102 0.0878 1.4322 0.0855 0.9787 0.4143 0.8713 38.8600 4.2749 1.1242 43.8352 4.4175 2.7630 16.8232 132.8960 38.9796 0.4424 51.1755 60.1078 7.7733 2.0030 0.0001 0.3591 362.0334 192.1882 0.3593 4.4444 13.4565 0.8535 172.4385 24.5180 36.8051 13.5223 3.4760 298.4149 5.5823 1.8581 49.1290 204.8260 37.9261 13.6910 5.3563 2.7284 42.9565
temp: 298.150 k
press: 1.00000 atm
elementType: 17 17 17 8 8 8 6 6 6 6 6 6 6 6 1 1 1 1 1
symmnumber: 1
zpe: 301002.2 jmol-1
zpe.correction: 0.114646 hartree
zpe.thermalcorrener: 0.128454 hartree
zpe.thermalcorrenthalpy: 0.129398 hartree
zpe.thermalcorrgfe: 0.071218 hartree
zpe.sumelectzpe: -1912.654540 hartree
zpe.sumelectthermal: -1912.640732 hartree
zpe.sumelectthermalent: -1912.639788 hartree
zpe.sumelectthermalfe: -1912.697968 hartree
dipole: 3.2110 -4.5926 -0.0052
dipole: 5.6037
quadrupole: -91.5294 -99.5959 -100.9682
quadrupole: -9.7348 -0.0376 -0.0256
quadrupole: 5.8351 -2.2314 -3.6037 -9.7348 -0.0376 -0.0256
hfenergy: -1912.7691859 hartree
pointgroup: C01 [X(C8H5Cl3O3)]
dipole: 1.1836012 -1.8523315 -0.1690837 debye
dipolederiv: -0.0847653 -0.1797424 -0.0044503 -0.2322599 -0.5431051 -0.0164449 -0.0072959 -0.0192567 0.0069247 -0.3258324 0.2953187 0.033834 0.3431553 -0.336408 -0.0369426 0.036198 -0.0342605 -0.0030725 -0.7127176 -0.190032 0.0285908 -0.1937136 -0.1210064 0.0058206 0.0283715 0.0056207 -0.0267017 -1.8978223 0.1474726 0.1019343 0.0238041 -0.2141816 0.0004646 0.0944215 -0.0070998 -0.2529042 -1.0328953 0.5456401 0.0656198 0.5188649 -0.7201775 -0.0466965 0.0648906 -0.0484339 -0.4458753 -0.6945844 -0.1782578 0.0140639 0.0445796 -0.8691428 -0.0359838 0.0271442 -0.0225494 -0.2856786 1.5959046 -0.0463409 -0.0851066 0.2893342 -0.1355896 -0.031629 -0.0657835 -0.0121636 0.1407974 -0.2626211 0.2862423 0.0260598 0.5678452 0.7449594 0.0123222 0.041268 0.0279969 -0.0766114 -0.2458263 0.1294157 0.0093867 -0.2509607 -0.0192975 0.0241659 -0.0114191 0.0026449 -0.2026439 0.3705064 -0.5111427 -0.0481344 -0.5757847 0.4323209 0.0552978 -0.051418 0.0517347 -0.0060605 -0.1037457 -0.2044581 -0.009622 0.0162476 0.0240419 0.0048132 0.0019994 0.0171896 -0.0837427 0.8662978 0.4510913 -0.0288907 0.3082877 -0.0784346 -0.0175956 -0.0366091 -0.0256116 -0.0701868 0.581895 -0.2363946 -0.0236162 -0.8179955 0.2042948 0.0370405 -0.0555448 0.0038493 0.3880377 1.6254681 -0.2113952 -0.0957239 -0.242283 1.3909628 0.0816578 -0.098802 0.0795703 0.2165239 -0.0026343 0.0775453 0.0141041 0.0973009 0.0181099 -0.0138988 0.0151897 -0.0128417 0.1736023 0.0681908 -0.0331694 0.0037641 -0.0350461 -0.0108711 -0.0074212 0.0037101 -0.0075697 0.1658453 0.0076233 -0.0138281 0.0187826 0.1491596 -0.0044562 0.0651042 -0.008568 0.0827902 -0.015219 0.0072265 -0.0211876 -0.024612 0.1389614 0.0124609 -0.078629 0.0207186 -0.0776632 -0.0311063 0.2403323 -0.1067771 0.0040162 -0.1494971 0.2255197 -0.0014455 0.0015288 -0.0039465 0.4080717 unknown
polarizability: 183.4948397|1.0264063|141.3073753|-7.4685403|4.7962258|51.3547845 unknown
InChI: InChI=1S/C8H5Cl3O3/c9-4-1-2-5(8(11)7(4)10)14-3-6(12)13/h1-2,12H,3H2
charge 0 multiplicity 1
19 atoms
Cl -0.369394 2.641647 0.149711
Cl -3.539407 1.976432 0.289895
Cl -4.518666 -1.130772 0.181151
O  1.338415 0.295559 -0.071075
O  4.664158 -1.121275 -0.348056
O  3.99098 1.107591 -0.182129
C  0.000732 -0.104272 -0.017225
C  -0.956461 0.943507 0.091904
C  -0.442428 -1.447648 -0.063891
C  -2.335961 0.645505 0.152841
C  -1.819807 -1.741326 -0.002401
C  -2.761426 -0.704268 0.105123
C  2.335879 -0.757227 -0.188073
C  3.708798 -0.09819 -0.233227
H  0.269051 -2.272726 -0.147989
H  -2.164256 -2.778098 -0.03814
H  2.303467 -1.4487 0.67797
H  2.19658 -1.350124 -1.114476
H  5.577146 -0.727015 -0.380213
