program: Gaussian 09
title: 000147045
version: EM64L-G09RevD.01
frameworkgroup: C1[X(C20H30N2O2)]
method: RPBEPBE
basis: SDD
operation: Freq
keyword: #p
keyword: freq=noraman
keyword: PBEPBE/SDD
title: #p freq=noraman PBEPBE/SDD
converged: YES YES NO NO
title: Mulliken charges:
elementType: O O N N C C C C C C C C C C C C C C C C C C C C H H H H H H H H H H H H H H H H H H H H H H H H H H H H H H
charge: -0.238649 -0.222311 -0.182022 0.003601 0.168974 -0.559646 -0.401866 0.120978 -0.507583 0.437452 -0.388138 0.179372 -0.367425 -0.726210 -0.372249 -0.394279 -0.339537 -0.337442 -0.372149 -0.355287 -0.355082 -0.359701 -0.356107 -0.696599 0.220502 0.248345 0.210937 0.245294 0.261176 0.255074 0.245265 0.243676 0.215341 0.225352 0.243204 0.226826 0.214611 0.197489 0.197726 0.197457 0.199041 0.272614 0.232898 0.191082 0.191070 0.189221 0.188749 0.242925 0.241106 0.195065 0.194839 0.215084 0.210098 0.209838
chargesum: 0.00000
title: Mulliken charges with hydrogens summed into heavy atoms:
elementType: O O N N C C C C C C C C C C C C C C C C C C C C
charge: -0.238649 -0.222311 -0.182022 0.003601 0.168974 -0.090798 0.054366 0.120978 0.008667 0.437452 0.100803 0.179372 0.073268 -0.041569 0.022966 0.002219 -0.066923 -0.104544 0.010002 0.022683 -0.112157 -0.118595 0.033797 -0.061579
polarizability: 2.57406978e+02 -1.77668052e+00 2.26900132e+02 -1.08496739e+01 2.27646134e-01 2.03577081e+02
1716.lowfreq: -5.9195 -1.3114 -0.0007 0.0007 0.0007 9.8227 15.2488 17.5642 22.6413
frequency: 14.9282 17.0460 22.5895 33.7177 44.3979 47.5083 64.0950 88.7588 91.3960 97.0743 101.1605 111.4720 141.0441 145.6789 146.9793 163.0929 176.4578 213.1448 227.0607 230.2469 233.9690 279.8911 292.7058 311.7565 311.8957 334.0519 356.2756 368.7889 383.9288 420.6484 436.3439 444.2991 463.9782 508.8797 527.5697 549.0448 567.6444 594.3876 645.9079 662.3042 684.5708 720.9658 721.5533 730.6413 743.1130 747.8608 754.0535 779.1850 799.6372 823.9621 847.8793 878.4911 887.9791 891.1579 899.8716 922.0134 954.1705 962.8785 965.1881 971.5809 986.8787 990.1514 1007.4849 1014.1052 1029.9946 1046.5297 1048.1507 1058.2583 1066.7318 1068.9825 1079.0608 1082.2170 1085.7099 1097.2326 1118.5957 1122.3738 1134.5464 1151.1016 1177.3993 1184.9338 1211.1514 1219.0788 1222.9495 1231.2927 1241.3125 1260.2202 1262.8378 1277.7773 1280.1203 1289.4024 1292.4819 1294.2007 1294.9602 1303.7035 1315.4701 1326.6559 1333.0951 1335.7699 1338.2607 1344.1232 1353.4691 1353.5089 1356.0335 1374.8530 1389.4608 1390.9054 1402.3058 1442.6914 1447.8144 1454.2827 1461.1851 1462.1786 1465.5424 1465.8855 1469.9084 1477.0721 1477.4758 1480.5647 1484.0365 1484.2302 1488.3008 1495.0113 1546.4195 1570.9303 1578.2652 1624.5715 2950.5776 2952.8995 2955.1718 2962.4465 2968.5192 2971.5757 2985.2724 2986.1802 2987.6177 2993.6670 2993.7006 3000.6190 3005.2759 3015.6762 3022.3672 3037.2286 3037.9008 3051.6354 3056.4654 3065.4493 3068.2719 3070.2067 3077.4362 3079.9924 3090.1842 3106.7838 3128.1882 3133.4943 3157.1779 3162.0201
redmass: 5.4678 4.4238 3.8309 1.6042 4.2412 3.7871 5.3860 2.9447 1.6836 3.0965 2.4107 4.1944 1.8986 2.1893 3.8467 4.1849 2.6297 1.8116 4.5949 4.6451 1.1164 2.1062 2.5328 3.6764 3.3038 3.5207 3.1483 2.5120 3.6411 3.5953 3.8681 4.0411 3.9828 3.8830 3.9625 3.5947 3.0733 4.2642 4.8738 6.8891 4.9098 4.2216 1.1345 1.0903 1.4202 1.4691 2.6891 1.2615 1.5687 1.4890 1.3212 2.2571 1.9577 1.3025 2.3613 1.6595 1.7142 1.7593 4.5861 1.6224 1.4552 4.3301 1.9150 1.7122 2.3087 2.5415 3.2117 1.8201 2.8683 2.4382 2.4145 2.1624 2.2914 1.6925 3.5866 2.8076 2.3827 1.9632 1.8783 1.8959 1.7225 1.2833 1.8901 1.2791 1.5358 1.4932 1.2938 1.3341 1.0248 1.9100 1.2404 1.9660 1.4380 1.3702 2.1199 1.4577 1.4462 1.3293 1.4338 1.3802 1.6532 1.5869 1.6045 1.4053 1.2171 1.2104 1.9513 1.1000 1.0846 1.0924 1.0740 1.0731 1.3406 1.3575 1.0815 1.0797 1.0432 1.0599 1.0844 1.0522 1.0913 1.0855 6.9364 8.6636 5.9145 9.7733 1.0589 1.0587 1.0591 1.0590 1.0585 1.0368 1.0963 1.0361 1.0598 1.0634 1.0982 1.0651 1.1020 1.0609 1.1041 1.1045 1.0579 1.1042 1.0987 1.0999 1.1007 1.0993 1.0973 1.0980 1.1010 1.1064 1.0879 1.0894 1.0943 1.0972
irintensity: 0.2961 0.4327 0.0068 0.0857 0.2452 0.2434 1.5446 0.2025 0.0063 0.2013 0.4217 1.9544 0.6494 0.0235 5.3919 3.2562 1.0556 0.6129 1.0721 1.9005 0.0038 0.5231 0.1877 0.5923 0.7302 4.0611 10.5395 0.2665 9.8411 4.3371 1.2909 3.9218 1.8336 4.6678 4.5652 21.8030 12.7505 12.1344 1.8340 0.7569 14.9732 4.7476 10.1820 1.4750 6.2165 7.7425 2.8536 1.9798 22.5998 32.7358 2.5636 1.5611 8.2927 1.5462 7.3052 3.0169 11.7377 1.6214 3.3353 1.4374 0.3591 1.1064 4.3240 5.2120 4.2220 2.1522 3.9721 19.5130 3.6811 13.6682 0.0066 0.2146 2.7551 10.3231 19.9816 14.6843 125.5599 8.5994 17.0840 18.5461 28.7774 10.6473 3.4036 1.5158 4.1808 32.0201 1.7520 24.6398 1.1925 24.7248 2.9338 59.9542 35.4989 9.4043 32.0627 7.5804 1.9591 4.9392 3.5336 24.0334 1.2500 45.4753 0.2594 6.6500 11.2515 15.9586 16.4903 30.2289 5.9311 19.2615 0.0551 0.3758 7.7808 10.6583 2.5180 2.3031 12.0035 9.5605 5.6243 17.8436 28.3434 9.1013 13.4472 249.9454 115.2254 90.3580 0.0019 3.7596 0.1326 25.2499 141.3151 35.5557 0.3461 29.0526 32.1587 20.3594 1.8164 7.1128 1.0045 29.8640 0.0024 74.9387 25.2072 70.4342 1.8160 23.8595 96.1400 55.7365 6.5752 43.5664 33.7679 5.7431 14.6746 13.3894 25.0716 1.2577
temp: 298.150 k
press: 1.00000 atm
elementType: 8 8 7 7 6 6 6 6 6 6 6 6 6 6 6 6 6 6 6 6 6 6 6 6 1 1 1 1 1 1 1 1 1 1 1 1 1 1 1 1 1 1 1 1 1 1 1 1 1 1 1 1 1 1
symmnumber: 1
zpe: 1219324.2 jmol-1
zpe.correction: 0.464416 hartree
zpe.thermalcorrener: 0.490081 hartree
zpe.thermalcorrenthalpy: 0.491025 hartree
zpe.thermalcorrgfe: 0.404888 hartree
zpe.sumelectzpe: -1038.258102 hartree
zpe.sumelectthermal: -1038.232437 hartree
zpe.sumelectthermalent: -1038.231493 hartree
zpe.sumelectthermalfe: -1038.317630 hartree
dipole: -2.0727 -2.1068 -0.5176
dipole: 3.0004
quadrupole: -129.0363 -160.7420 -154.8152
quadrupole: 11.4859 -5.8404 1.7540
quadrupole: 19.1616 -12.5442 -6.6174 11.4859 -5.8404 1.7540
hfenergy: -1038.7225181 hartree
pointgroup: C01 [X(C20H30N2O2)]
dipole: 0.7985803 0.8474582 -0.1938438 debye
polarizability: 257.7477837|-1.5155326|226.8362913|10.0680534|0.5534157|203.3001165 unknown
InChI: InChI=1S/C20H30N2O2/c1-3-5-6-7-8-9-16-22-18(23)10-13-20(4-2,19(22)24)17-11-14-21-15-12-17/h11-12,14-15H,3-10,13,16H2,1-2H3
charge 0 multiplicity 1
54 atoms
O  0.95184 0.828571 -1.924846
O  0.333655 2.013655 2.529357
N  0.690784 1.479006 0.288197
N  3.154684 -3.81723 0.225564
C  2.936144 0.549314 -0.492343
C  3.473559 1.404926 0.682185
C  3.786687 0.765741 -1.795654
C  1.469775 0.960132 -0.779762
C  2.582199 1.270081 1.926944
C  2.972529 -0.974125 -0.189608
C  -0.727411 1.844891 -0.007986
C  1.130554 1.617657 1.637235
C  -1.697588 0.661616 0.192555
C  3.899331 2.2250 -2.285154
C  -3.155612 1.077624 -0.103127
C  -4.167607 -0.071319 0.105041
C  2.101357 -1.880108 -0.848817
C  3.94362 -1.540494 0.675881
C  -5.626222 0.350751 -0.182002
C  -6.649585 -0.787038 0.032512
C  2.225108 -3.26682 -0.611944
C  3.996836 -2.941941 0.849187
C  -8.107362 -0.355878 -0.248546
C  -9.126678 -1.495118 -0.031666
H  4.516225 1.127605 0.918002
H  3.498944 2.463509 0.367122
H  4.795829 0.351792 -1.601309
H  3.332652 0.153174 -2.594463
H  2.608025 0.235426 2.320992
H  2.911971 1.929787 2.747358
H  -0.762617 2.192478 -1.053616
H  -0.996118 2.670423 0.671979
H  -1.404363 -0.17077 -0.476315
H  -1.618943 0.298806 1.235269
H  2.90164 2.66128 -2.468715
H  4.453121 2.253272 -3.240865
H  4.442611 2.872356 -1.573443
H  -3.433903 1.929494 0.55195
H  -3.23045 1.445953 -1.147617
H  -3.895771 -0.925053 -0.55007
H  -4.091291 -0.442066 1.148285
H  1.340794 -1.517297 -1.547066
H  4.664744 -0.917822 1.214114
H  -5.702159 0.719212 -1.226618
H  -5.892757 1.209223 0.469785
H  -6.573355 -1.158591 1.075927
H  -6.389588 -1.645329 -0.622067
H  1.556543 -3.976845 -1.111746
H  4.742802 -3.390829 1.515271
H  -8.364924 0.502022 0.405881
H  -8.181971 0.016113 -1.29097
H  -10.160188 -1.160185 -0.236977
H  -9.091653 -1.864259 1.010836
H  -8.910648 -2.352376 -0.697117
