program: Gaussian 09
title: 000146978
version: EM64L-G09RevD.01
frameworkgroup: C1[X(C10H8N2O2)]
method: RPBEPBE
basis: SDD
operation: Freq
keyword: #p
keyword: freq=noraman
keyword: PBEPBE/SDD
title: #p freq=noraman PBEPBE/SDD
converged: NO YES NO NO
title: Mulliken charges:
elementType: O O N N C C C C C C C C C C H H H H H H H H
charge: -0.201911 -0.202391 0.007147 0.030093 0.283856 -0.211282 0.448775 0.261155 -0.370805 -0.420149 -0.226443 -0.785276 -0.278789 -0.364332 0.303021 0.244620 0.236066 0.213550 0.247852 0.247757 0.285034 0.252456
chargesum: 0.00000
title: Mulliken charges with hydrogens summed into heavy atoms:
elementType: O O N N C C C C C C C C C C
charge: -0.201911 -0.202391 0.007147 0.030093 0.283856 -0.211282 0.448775 0.261155 -0.067784 -0.175529 0.009622 -0.076118 0.006245 -0.111875
polarizability: 1.90992578e+02 -1.37222718e+01 1.62894344e+02 8.56176038e-03 4.94680922e-03 5.41082291e+01
1716.lowfreq: -17.3459 -9.2499 -0.0007 -0.0005 -0.0001 3.9500 6.3105 68.8597 113.1719
frequency: -15.8027 68.8538 113.1679 179.6753 184.5743 214.8947 242.9614 277.4319 357.3982 380.7437 444.6657 465.1003 487.8267 512.3514 552.8414 559.8426 594.6462 629.6109 709.0444 710.8825 785.2116 795.4811 819.6840 822.1076 858.0256 871.1201 926.4716 978.9416 985.3359 1004.1180 1050.3669 1057.6875 1089.6635 1102.7427 1179.1482 1191.1694 1195.5474 1215.6659 1262.4678 1329.9262 1335.1131 1369.0752 1386.7874 1402.0613 1410.4158 1452.0005 1454.6551 1467.4031 1489.6044 1557.4934 1582.6956 1613.3887 2994.7633 3079.6499 3097.8253 3133.4014 3142.3873 3155.3578 3193.2591 3218.7553
redmass: 13.3180 4.6963 1.0443 4.0603 4.6312 6.1061 3.5843 4.1926 9.7846 6.1752 4.9495 3.1089 6.0229 4.6823 6.9015 4.8728 6.8972 3.5097 5.4224 9.5416 1.9223 5.2508 2.1814 8.9305 5.1350 1.3471 1.3755 1.4253 1.7805 1.3444 1.5695 2.3936 2.1909 2.3982 2.4352 2.1395 2.3730 2.4282 1.9101 3.8632 4.6194 3.6122 2.5250 1.3234 2.5877 1.0460 2.6725 1.2883 2.9635 7.1203 6.9752 6.2805 1.0362 1.0963 1.1012 1.0884 1.0913 1.0955 1.0941 1.0935
irintensity: 0.0205 1.1317 0.7318 4.7433 8.5158 1.1579 1.7093 2.7887 2.1490 2.8751 0.6731 0.0261 3.7129 1.5644 3.0382 1.2249 5.8336 0.3244 3.3193 16.9918 30.5701 3.0200 38.0576 8.9965 5.8191 38.1242 0.3451 0.8574 12.0342 1.6701 8.9666 9.2112 8.0197 4.3936 159.1578 117.9151 29.6635 45.8990 0.7901 13.3446 14.9755 65.6851 46.6228 36.6653 4.6081 14.0170 12.2414 3.1738 50.0690 23.1971 3.6448 4.2735 21.7243 10.7559 20.8382 12.9126 19.1243 20.8049 2.9896 8.4263
temp: 298.150 k
press: 1.00000 atm
elementType: 8 8 7 7 6 6 6 6 6 6 6 6 6 6 1 1 1 1 1 1 1 1
symmnumber: 1
zpe: 423140.0 jmol-1
zpe.correction: 0.161166 hartree
zpe.thermalcorrener: 0.171582 hartree
zpe.thermalcorrenthalpy: 0.172526 hartree
zpe.thermalcorrgfe: 0.124925 hartree
zpe.sumelectzpe: -644.754977 hartree
zpe.sumelectthermal: -644.744560 hartree
zpe.sumelectthermalent: -644.743616 hartree
zpe.sumelectthermalfe: -644.791218 hartree
dipole: 3.6930 0.5901 0.0007
dipole: 3.7398
quadrupole: -88.3510 -73.8972 -82.0140
quadrupole: -9.6029 0.0009 0.0005
quadrupole: -6.9302 7.5235 -0.5933 -9.6029 0.0009 0.0005
hfenergy: -644.9161424 hartree
pointgroup: C01 [X(C10H8N2O2)]
dipole: -1.4485502 0.2580808 -0.00026 debye
dipolederiv: -1.0301141 -0.1522324 -0.0000853 -0.1638134 -0.4626193 -0.0000449 -0.0000333 -0.0000218 -0.2204711 -0.5026211 0.0786127 -0.0000189 0.1658234 -0.7235243 -0.0000161 -0.0000207 -0.0000379 -0.2188355 -0.1192083 0.0276834 0.0000025 0.3399707 -0.1917483 0.000023 -0.00013 0.0000925 -0.2004124 1.7515065 -0.0831338 0.0001373 -0.3401104 1.0551662 0.0000564 0.0001013 0.0000564 0.1767972 -0.233017 -0.1455278 0.0000073 0.5428862 0.063587 0.0000314 0.0000137 0.0000058 0.0995703 0.1233851 0.3864386 -0.0000139 -0.2685752 -0.1077862 -0.0000488 0.0000345 -0.0000273 0.0022184 0.3734376 -0.2028854 0.0001418 -0.3466799 0.1574458 -0.0001222 0.0004466 -0.0002299 0.0049098 -0.3566244 0.2147336 -0.0000339 0.5015628 0.0230938 -0.0000061 -0.000039 -0.000005 0.0492369 -0.3276263 -0.0857065 -0.0000538 -0.2978614 -0.0873115 -0.0000045 -0.0000125 0.0000075 -0.168982 0.0954166 0.1171488 0.000012 0.2810318 -0.2371655 0.0000744 -0.0000089 0.0000531 -0.1651842 0.2144229 -0.0762706 0.0000319 -0.056357 0.2528111 -0.0000294 -0.0000197 0.0000076 -0.1100724 -0.0167255 0.1131473 -0.0001694 0.2560592 -0.0861475 -0.0000153 -0.0008019 0.0002146 0.0240362 0.0709993 0.1349843 0.0000034 -0.3996662 -0.2676477 -0.0000071 -0.0000224 0.0000015 -0.0453519 -0.2774147 -0.2041754 -0.0000277 0.0082192 0.4442888 -0.000021 0.0000448 -0.0000588 -0.0711769 0.1098298 0.0871222 0.0000075 0.0115551 0.0773067 0.0000009 -0.0000024 -0.0000144 0.1749175 -0.1057881 -0.0759161 0.000006 -0.0548144 0.0728481 -0.0000169 0.0000308 -0.0000055 0.1531502 0.0834699 -0.0256308 0.0000055 -0.0288709 -0.1058829 0.0000049 0.0000146 0.0000008 0.1510726 -0.116807 -0.0489228 0.0003223 -0.1717564 0.0134001 0.0003065 0.0004566 0.000108 0.1076888 0.0646273 0.0071897 -0.0302788 0.0352869 0.0407725 -0.0938522 0.0240231 -0.0980373 -0.0197733 0.0643293 0.0076109 0.030003 0.0355771 0.0411785 0.0936773 -0.0240863 0.0978717 -0.0205775 0.0680338 -0.0515987 0.0000011 -0.0187913 0.1282133 0.0000021 -0.0000111 0.0000086 0.1658715 0.0664884 -0.0226713 0.0000002 -0.030676 -0.1002789 0.0000078 0.0000223 0.0000098 0.1313676 unknown
polarizability: 191.4736457|13.2118192|162.4132767|0.0084721|-0.0050989|54.1082291 unknown
InChI: InChI=1S/C10H8N2O2/c1-7-3-2-4-8-9(12(13)14)5-6-11-10(7)8/h2-6H,1H3
charge 0 multiplicity 1
22 atoms
O  3.768267 0.266176 0.00013
O  2.701219 -1.735962 -0.000069
N  -0.958661 1.887499 -0.000155
N  2.688698 -0.445224 0.000043
C  0.098358 -0.388288 -0.000068
C  -1.064508 0.505856 -0.000107
C  -2.406977 -0.033742 -0.000116
C  1.379711 0.279621 -0.000056
C  -0.131138 -1.801965 -0.000054
C  -2.566392 -1.423888 -0.00007
C  -1.438288 -2.295583 -0.000052
C  -3.594077 0.90378 -0.000366
C  1.468448 1.674865 -0.000119
C  0.269348 2.438973 -0.000164
H  0.716301 -2.485243 -0.000073
H  -3.576615 -1.847993 -0.00006
H  -1.597435 -3.379483 -0.000037
H  -4.540793 0.337446 0.001518
H  -3.572804 1.57019 0.879595
H  -3.574715 1.567156 -0.882712
H  2.447631 2.157923 -0.000107
H  0.317223 3.533185 -0.000198
