program: Gaussian 09
title: 000146988
version: EM64L-G09RevD.01
frameworkgroup: C1[X(C12H15ClN2)]
method: RPBEPBE
basis: SDD
operation: Freq
keyword: #p
keyword: freq=noraman
keyword: PBEPBE/SDD
title: #p freq=noraman PBEPBE/SDD
converged: YES YES NO NO
title: Mulliken charges:
elementType: Cl N N C C C C C C C C C C C C H H H H H H H H H H H H H H H
charge: -0.078915 -0.076084 -0.411811 -0.562120 0.414984 -0.354699 0.106055 0.254182 -0.444318 -0.400386 -0.344662 -0.621514 -0.615486 -0.252871 -0.068608 0.216379 0.225822 0.190242 0.226031 0.271897 0.308647 0.237747 0.256359 0.232738 0.184660 0.221743 0.221573 0.187688 0.226124 0.248603
chargesum: 0.00000
title: Mulliken charges with hydrogens summed into heavy atoms:
elementType: Cl N N C C C C C C C C C C C C
charge: -0.078915 -0.076084 -0.103164 -0.119920 0.414984 0.061574 0.106055 0.254182 -0.172422 -0.162639 -0.088303 0.017628 0.019900 -0.004269 -0.068608
polarizability: 2.11590452e+02 1.68335489e+01 1.60804738e+02 -1.02739646e+01 7.61227641e+00 9.01015179e+01
1716.lowfreq: -7.9901 -5.6610 -4.0962 -0.0034 -0.0021 -0.0017 35.4488 37.0417 52.0420
frequency: 35.4320 36.6130 52.0357 107.5403 111.8255 176.5797 199.6075 210.5491 231.5674 244.1981 258.7396 285.3551 330.3050 360.3746 365.6898 420.0716 431.0904 447.4750 467.0940 513.3947 576.1150 590.0555 610.9427 645.4334 739.2319 748.0035 766.7987 789.0060 800.9535 806.9258 835.1278 850.4141 884.9722 940.3057 1008.8249 1015.3624 1033.4060 1050.7448 1057.5956 1069.1530 1092.2631 1097.4750 1126.0812 1141.8695 1158.7655 1216.7654 1235.8192 1238.3197 1261.6553 1282.8238 1291.6585 1307.0423 1329.8052 1366.0756 1389.2923 1398.4436 1419.0131 1442.1915 1459.4461 1461.1412 1463.7333 1468.4005 1474.1689 1476.4305 1481.3034 1486.9636 1560.3433 1583.1554 1624.3759 2837.2932 2841.1965 2862.0755 2983.4016 3018.4361 3023.0585 3029.6706 3053.5503 3077.3524 3086.3529 3141.0893 3163.4518 3173.4007 3222.3098 3614.4762
redmass: 3.3894 3.3273 4.8379 2.6675 3.5711 3.4005 3.2236 3.6476 1.2166 1.4267 2.7268 3.8994 3.3181 3.0225 7.6142 2.8670 3.1684 2.4211 3.6842 1.1651 5.7169 4.2185 3.3765 4.4312 4.9633 3.3307 2.5386 1.7762 1.4578 1.5686 3.8708 1.4690 5.3097 1.3313 2.1828 2.2108 1.6647 2.0189 2.5398 2.9973 1.3100 1.5879 1.3037 1.3993 1.6722 1.7243 1.5646 2.1996 2.4870 1.9071 1.2772 1.5967 1.7780 1.3622 5.8756 2.9874 1.1423 1.1596 2.7660 1.2900 1.0635 3.1538 1.0719 1.0589 1.0766 1.0622 7.1205 6.7077 7.0170 1.0685 1.0579 1.0587 1.0621 1.0723 1.0853 1.0724 1.1003 1.1010 1.1002 1.0890 1.0931 1.0957 1.0985 1.0810
irintensity: 0.8698 0.6520 0.5158 0.8235 0.1216 0.5008 1.2633 2.1383 0.9524 2.0871 4.2005 0.7423 9.6222 3.0133 5.3774 9.1353 6.4175 0.7161 4.3262 118.8159 10.5982 1.8048 2.5216 0.8504 15.7668 0.8438 15.4004 14.5574 22.4001 56.7472 9.3812 27.7109 35.6366 0.1210 6.5349 12.0652 26.7560 10.9627 42.8304 14.3528 7.7351 39.3290 3.3934 8.2338 7.1371 8.7121 19.9379 1.4644 7.1427 1.4812 0.4842 11.3296 28.4829 11.0110 34.9790 3.5844 3.1165 2.1527 26.6182 6.7503 19.6238 15.0136 1.2669 15.6316 18.4644 24.7649 10.0252 2.8708 29.9367 72.7358 77.4279 199.0236 26.2261 47.0515 30.2384 39.1502 29.3789 34.8437 49.4750 9.1487 2.4292 5.3709 0.8562 64.5263
temp: 298.150 k
press: 1.00000 atm
elementType: 17 7 7 6 6 6 6 6 6 6 6 6 6 6 6 1 1 1 1 1 1 1 1 1 1 1 1 1 1 1
symmnumber: 1
zpe: 643392.6 jmol-1
zpe.correction: 0.245055 hartree
zpe.thermalcorrener: 0.259766 hartree
zpe.thermalcorrenthalpy: 0.260710 hartree
zpe.thermalcorrgfe: 0.202129 hartree
zpe.sumelectzpe: -1034.717197 hartree
zpe.sumelectthermal: -1034.702486 hartree
zpe.sumelectthermalent: -1034.701542 hartree
zpe.sumelectthermalfe: -1034.760124 hartree
dipole: 1.9963 2.1769 0.4249
dipole: 2.9841
quadrupole: -105.3557 -81.7044 -99.2255
quadrupole: -12.1518 -0.1647 4.1225
quadrupole: -9.9272 13.7241 -3.7970 -12.1518 -0.1647 4.1225
hfenergy: -1034.9622525 hartree
pointgroup: C01 [X(C12H15Cl1N2)]
dipole: 0.7635895 0.8906306 0.045362 debye
polarizability: 209.6486973|16.9332799|162.504383|-16.4693343|-1.1255723|90.3436271 unknown
InChI: InChI=1S/C12H15ClN2/c1-15(2)6-5-9-8-14-12-7-10(13)3-4-11(9)12/h3-4,7-8,14H,5-6H2,1-2H3
charge 0 multiplicity 1
30 atoms
Cl -4.922253 -1.48227 0.654771
N  4.013922 -0.42692 0.121291
N  -1.300276 2.376382 0.0206
C  1.8773 0.552903 -0.811603
C  0.483189 1.022472 -0.474385
C  2.595045 -0.101134 0.399639
C  -0.689131 0.191588 -0.242447
C  -1.790535 1.069565 0.065636
C  0.06738 2.342571 -0.305404
C  -0.921974 -1.209278 -0.273665
C  -3.091995 0.594162 0.344187
C  4.182381 -1.502274 -0.877488
C  4.762328 -0.718867 1.36208
C  -2.211687 -1.705709 -0.002103
C  -3.261231 -0.798066 0.301417
H  1.829617 -0.167544 -1.651544
H  2.500674 1.400285 -1.151345
H  2.018447 -1.004604 0.730998
H  2.572119 0.616885 1.240706
H  0.643519 3.261653 -0.397841
H  -1.845755 3.218881 0.186228
H  -0.111594 -1.907484 -0.508934
H  -3.927059 1.2598 0.57984
H  3.73312 -1.20916 -1.841266
H  3.720894 -2.473233 -0.558628
H  5.259275 -1.677061 -1.050437
H  5.831282 -0.868081 1.125217
H  4.397683 -1.632702 1.897903
H  4.68253 0.137306 2.055462
H  -2.415716 -2.779866 -0.020785
