program: Gaussian 09
title: 000146971
version: EM64L-G09RevD.01
frameworkgroup: C1[X(C12H9I)]
method: RPBEPBE
basis: SDD
operation: Freq
keyword: #pfreq=noraman
keyword: PBEPBE/SDD
title: #p freq=noraman PBEPBE/SDD
converged: NO YES NO NO
title: Mulliken charges:
elementType: I C C C C C C C C C C C C H H H H H H H H H
charge: 0.071153 -0.163098 -0.557081 -0.547731 0.463720 0.326312 0.510639 -0.574825 -0.427861 -0.434721 -0.441825 -0.181139 -0.215249 0.254090 0.254084 0.237617 0.237606 0.242734 0.242537 0.239927 0.241257 0.221854
chargesum: 0.00000
title: Mulliken charges with hydrogens summed into heavy atoms:
elementType: I C C C C C C C C C C C C
charge: 0.071153 -0.163098 -0.048907 -0.072509 0.463720 0.326312 0.510639 -0.574825 -0.185126 -0.192183 -0.201899 0.060118 0.006605
polarizability: 2.42969962e+02 -1.06475330e+00 1.54637014e+02 1.29896129e-03 1.30290752e-03 6.01040644e+01
1716.lowfreq: -10.5430 -0.0007 -0.0004 0.0002 4.3548 7.5144 69.8249 97.5756 125.0304
frequency: 69.8105 97.5051 125.0296 200.0989 212.6964 213.6330 275.3618 433.6805 444.0340 473.6912 496.1133 507.0933 552.4418 556.5713 633.2799 633.7989 658.7473 752.5230 772.4521 814.5009 815.8145 822.7955 853.7199 906.4810 951.1870 962.8361 981.4717 1004.9287 1007.7430 1031.7983 1075.1015 1108.0126 1146.3943 1176.4946 1194.1709 1203.3980 1222.8976 1239.0453 1251.6779 1289.6193 1347.5373 1387.5063 1407.8028 1439.8596 1455.6304 1463.0804 1468.6388 1492.6227 1585.2046 1602.3672 1621.1862 2992.5424 3004.8087 3035.7559 3056.7789 3121.8232 3133.5928 3135.8859 3154.3901 3162.1794
redmass: 5.8217 1.7663 6.9231 3.7477 11.1356 3.1396 4.5128 4.1315 3.4336 4.5151 3.7783 7.1427 2.6366 7.0684 5.7498 3.7829 6.1846 1.8881 1.2218 1.4962 4.8164 6.4021 2.1122 1.4101 3.3454 1.3404 1.3771 4.5927 1.9407 2.8209 3.1708 2.1511 1.1712 1.2249 1.4085 1.0979 1.3460 1.7930 1.9685 1.7645 3.3532 4.0091 1.8513 1.5327 2.5870 1.8804 1.6392 3.8365 6.9835 8.8122 7.4891 1.0594 1.0618 1.1026 1.1021 1.0858 1.0883 1.0921 1.0986 1.0960
irintensity: 0.1023 0.0173 0.2134 0.4539 0.9367 13.5932 0.0233 1.8064 0.1254 7.7213 3.6488 2.9680 0.6848 5.6088 0.0890 4.5808 0.4348 14.8912 19.6044 28.9916 0.5221 56.3346 57.4628 0.9674 2.9092 0.3641 2.0814 2.1894 0.9502 1.3286 51.6647 2.9664 0.2474 0.3854 3.6318 0.0144 4.3611 0.1898 6.3184 4.8162 18.1347 0.8819 6.0396 11.1260 2.0564 11.8363 17.2270 15.6683 39.7274 10.4917 0.7065 15.0487 34.2715 0.0075 25.6570 0.9621 1.7828 20.5570 40.4842 14.4064
temp: 298.150 k
press: 1.00000 atm
elementType: 53 6 6 6 6 6 6 6 6 6 6 6 6 1 1 1 1 1 1 1 1 1
symmnumber: 1
zpe: 444040.9 jmol-1
zpe.correction: 0.169126 hartree
zpe.thermalcorrener: 0.179289 hartree
zpe.thermalcorrenthalpy: 0.180234 hartree
zpe.thermalcorrgfe: 0.131658 hartree
zpe.sumelectzpe: -473.311591 hartree
zpe.sumelectthermal: -473.301428 hartree
zpe.sumelectthermalent: -473.300484 hartree
zpe.sumelectthermalfe: -473.349059 hartree
dipole: 1.8880 0.7353 0.0001
dipole: 2.0261
quadrupole: -83.5082 -78.2605 -94.8109
quadrupole: 0.5824 0.0005 0.0002
quadrupole: 2.0183 7.2661 -9.2844 0.5824 0.0005 0.0002
hfenergy: -473.4807175 hartree
pointgroup: C01 [X(C12H9I1)]
dipole: 0.7557508 -0.2535035 -0.0000341 debye
dipolederiv: -0.5863414 -0.0811746 -0.000023 -0.1674265 -0.0588012 0.0000372 0.0000945 0.0000276 -0.0207766 0.0190749 -0.0394901 -0.0000046 0.0935954 -0.213355 -0.000013 0.0000663 -0.0000358 -0.0333925 0.0951484 -0.0912165 0.0000546 -0.0017492 -0.0938512 0.0000195 -0.0000997 0.0000931 0.1414357 0.03204 0.0127099 0.0000279 -0.0999164 -0.0703068 -0.0000486 -0.0000834 -0.0001647 0.1540199 -0.4900514 -0.0172274 0.0000604 -0.1450777 0.2451892 0.0000315 -0.0000219 -0.000083 0.0245018 -0.0494886 0.1668576 -0.0000102 -0.0027916 0.2993768 0.0000547 0.0000117 0.0001385 -0.0275935 0.2229588 -0.0908975 -0.0000024 -0.072666 -0.1064878 -0.0000404 -0.0000523 0.0000242 0.0989758 1.2813137 0.3369513 -0.0000388 0.3135462 -0.1148377 -0.0000041 -0.000145 -0.0000724 -0.1907408 -0.049435 -0.2328293 0.000004 -0.0552137 -0.064953 -0.000052 -0.0000096 0.0000056 -0.1912331 -0.0641075 0.0363911 0.0000152 -0.1001572 0.0719568 0.0000334 0.0000241 -0.0000211 -0.1938426 -0.1215393 0.0853213 -0.0000297 0.1378468 0.0472071 0.0000341 0.0000593 -0.0000056 -0.2063517 -0.3783572 -0.1772505 0.0000229 0.0565845 0.0953251 -0.0000757 -0.0000393 0.0000334 -0.097109 0.068321 0.0846166 0.0000209 -0.0084159 0.096419 0.0000353 -0.000017 -0.0000028 -0.1415696 0.023109 -0.0175087 0.0675453 -0.0157689 0.0150519 0.0479799 0.087373 0.0845638 -0.0244683 0.0230063 -0.0175695 -0.0675894 -0.0158254 0.015056 -0.0479879 -0.0873039 -0.0845176 -0.0243095 0.0340289 -0.0010838 0.0383863 0.0244476 -0.0198954 -0.0837985 0.049406 -0.1400674 -0.0315589 0.0339889 -0.0009784 -0.0384205 0.0244262 -0.020035 0.0838204 -0.0493471 0.1400762 -0.0313862 -0.029619 0.0922762 -0.000006 0.1201133 -0.0221976 0.0000045 0.0000518 -0.0000139 0.157443 0.0272336 -0.0658537 -0.0000008 -0.0164683 -0.0978619 -0.0000172 0.0000137 0.0000089 0.1631862 0.0522402 -0.0250622 -0.0000091 -0.0941333 -0.0976043 -0.0000292 0.0000076 0.0000052 0.1620671 0.0042223 0.1036748 -0.0000158 0.08105 0.0213937 0.000012 0.0000102 0.0000029 0.1570457 -0.1477466 -0.0606566 0.0000127 -0.0559998 0.0732115 0.0000041 0.000001 0.0000048 0.1556571 unknown
polarizability: 242.6673647|5.2698606|154.9396113|-0.0013596|0.0012394|60.1040644 unknown
InChI: InChI=1S/C12H9I/c13-11-7-5-9-3-1-2-8-4-6-10(11)12(8)9/h1-3,5,7H,4,6H2
charge 0 multiplicity 1
22 atoms
I  -4.126082 -0.290472 0.000092
C  0.304062 -0.110054 -0.000069
C  -1.014452 -2.121609 0.000133
C  0.516866 -2.504505 -0.000288
C  -1.038481 -0.598254 -0.000007
C  1.259752 -1.168838 -0.000135
C  0.653196 1.275837 -0.000069
C  -2.064805 0.342357 -0.000005
C  2.617935 -0.843473 -0.000135
C  -0.439812 2.206945 -0.000061
C  2.054998 1.581488 -0.000079
C  -1.76466 1.747726 -0.000034
C  2.998907 0.543046 -0.000095
H  -1.538206 -2.527171 0.885966
H  -1.538835 -2.527459 -0.885184
H  0.77631 -3.111203 -0.887741
H  0.776721 -3.111775 0.886647
H  3.392995 -1.6181 -0.000179
H  -0.245249 3.285596 -0.000066
H  2.387265 2.626145 -0.000073
H  -2.588925 2.467582 -0.000027
H  4.066399 0.793091 -0.000091
