program: Gaussian 09
title: 000146970
version: EM64L-G09RevD.01
frameworkgroup: C1[X(C8H13NO)]
method: RPBEPBE
basis: SDD
operation: Freq
keyword: #p
keyword: freq=noraman
keyword: PBEPBE/SDD
title: #p freq=noraman PBEPBE/SDD
converged: YES YES NO NO
title: Mulliken charges:
elementType: O N C C C C C C C C H H H H H H H H H H H H H
charge: -0.227507 -0.079153 -0.401241 -0.484365 -0.385452 0.288167 -0.336335 -0.616406 0.108546 -0.782650 0.220134 0.190289 0.239469 0.240192 0.192068 0.236720 0.228912 0.221772 0.188548 0.230535 0.236456 0.258680 0.232623
chargesum: 0.00000
title: Mulliken charges with hydrogens summed into heavy atoms:
elementType: O N C C C C C C C C
charge: -0.227507 -0.079153 0.009182 -0.004705 0.043336 0.288167 -0.107423 0.024449 0.108546 -0.054892
polarizability: 1.24194903e+02 -1.00760573e+01 1.00787590e+02 -1.04104374e+00 1.45240536e+00 6.42790676e+01
1716.lowfreq: -8.3069 -0.0007 -0.0006 -0.0004 3.6471 14.1743 71.6149 73.8175 115.0714
frequency: 71.6057 73.7873 115.0587 172.6482 188.4753 213.1978 240.1060 299.6220 313.9912 348.1017 398.3219 448.5859 505.3108 544.0045 602.3160 639.7782 738.0183 778.2485 814.2969 907.9744 954.0820 961.9464 983.1977 1013.6323 1022.2318 1048.2488 1077.6262 1086.4338 1113.4424 1149.3800 1181.0165 1200.6203 1239.0329 1268.1981 1290.1120 1311.4924 1339.5675 1366.1664 1370.8791 1386.3225 1432.2593 1446.3695 1449.0401 1450.2663 1464.4175 1464.7856 1476.9530 1481.8956 1576.9124 1655.2895 2775.0267 2839.9666 2855.7248 2970.4697 2987.7135 2999.5770 3016.6481 3037.7725 3057.5591 3074.3620 3076.6535 3122.6830 3127.6744
redmass: 4.1928 3.0073 1.0463 2.8196 2.4842 1.7491 1.3393 2.5573 3.7838 2.4093 2.2670 3.1976 3.3028 4.7330 2.4675 3.6800 4.7354 1.8996 1.2359 2.5675 2.3996 2.0682 1.8326 2.4741 1.7278 1.8988 1.8537 1.5975 1.3343 2.1463 1.1601 1.5430 2.2298 2.2495 1.7811 1.3328 1.4699 1.3533 1.5280 2.1129 1.1603 1.0977 1.0837 1.0983 1.0500 1.0554 1.0892 1.0667 7.5628 6.8296 1.0716 1.0680 1.0605 1.0822 1.0371 1.0624 1.0725 1.0876 1.0992 1.0974 1.1005 1.0989 1.0910
irintensity: 3.8791 0.4823 0.1888 2.3284 5.8010 0.9220 2.3148 8.1941 3.4250 1.6578 0.2971 1.3270 1.8846 5.2345 6.3475 8.3964 8.2132 0.3378 16.0914 4.7253 45.0633 5.6301 4.0316 14.4715 3.0514 4.0416 5.3415 25.7976 10.5549 14.2147 2.0105 7.1047 49.2440 105.0942 31.2389 2.5700 0.1603 38.1111 1.2155 30.6114 0.7834 10.8499 12.8383 37.5007 16.5705 18.6209 11.7383 10.0764 156.6484 57.1731 79.1583 57.2528 216.5476 27.1805 4.4337 9.5867 49.7900 40.5649 16.8258 14.3248 30.8548 16.9339 11.4359
temp: 298.150 k
press: 1.00000 atm
elementType: 8 7 6 6 6 6 6 6 6 6 1 1 1 1 1 1 1 1 1 1 1 1 1
symmnumber: 1
zpe: 512104.0 jmol-1
zpe.correction: 0.195050 hartree
zpe.thermalcorrener: 0.205669 hartree
zpe.thermalcorrenthalpy: 0.206613 hartree
zpe.thermalcorrgfe: 0.159065 hartree
zpe.sumelectzpe: -441.810196 hartree
zpe.sumelectthermal: -441.799577 hartree
zpe.sumelectthermalent: -441.798632 hartree
zpe.sumelectthermalfe: -441.846181 hartree
dipole: -2.6933 3.0154 0.9236
dipole: 4.1472
quadrupole: -63.3357 -59.0519 -62.4615
quadrupole: 8.1792 -0.7553 -0.3489
quadrupole: -1.7193 2.5644 -0.8452 8.1792 -0.7553 -0.3489
hfenergy: -442.0052459 hartree
pointgroup: C01 [X(C8H13N1O1)]
dipole: 1.051272 1.1310895 -0.5270078 debye
dipolederiv: -0.8449425 -0.1787486 0.0631593 -0.2860384 -0.8160901 0.089251 0.0878152 0.0803202 -0.3416261 -0.655733 -0.0216047 0.0386118 0.0360202 -0.4946105 -0.0091468 -0.1214235 0.0051573 -0.5436697 0.1771527 0.094495 0.0884892 0.126877 0.334977 0.0970811 0.0573805 0.0867866 0.4379594 -0.0911636 0.0347155 0.0143699 0.0041119 -0.0230885 0.0376708 0.0163778 0.0572725 0.1271788 -0.0733819 -0.1753355 0.0404955 -0.419891 0.3358329 -0.0653939 0.1821119 -0.0551418 0.4148438 -0.7573167 -0.2786456 0.1218383 -0.332788 0.0192723 -0.0004991 0.1695324 -0.0319261 -0.0722256 0.4003186 0.1383966 -0.0711334 0.3714851 0.0743254 -0.0777439 -0.1645974 -0.0329313 -0.1803472 0.5737702 0.0224477 -0.109127 0.0410246 0.106652 -0.0119969 -0.1223217 -0.0217431 0.3840839 1.5213917 0.1975095 -0.1338964 0.0142642 0.9000385 -0.1088259 -0.116893 -0.1203073 0.1531056 -0.2237341 0.2049591 -0.0041877 0.3092558 -0.3211159 0.0236154 -0.0238623 0.0331545 0.0517984 -0.0409338 0.1429104 -0.0301486 0.1069033 -0.0869426 0.0185302 -0.0494839 0.0419555 0.0585518 0.0056278 -0.0419897 -0.0042411 -0.0485801 0.0008386 0.0439853 -0.0154655 -0.1196749 -0.287489 0.065261 0.0482297 -0.0108328 0.0238437 0.0447644 0.0322162 0.0006958 0.0632354 -0.0992672 0.0332885 -0.081639 -0.0402072 -0.0446185 -0.0192124 -0.0579375 -0.0384414 -0.0853802 0.0566849 -0.0667314 -0.0443332 0.087987 0.0706697 -0.0047545 0.0461621 0.0337863 0.1866177 -0.2054884 -0.0031425 -0.0799226 -0.0278305 0.015413 -0.0773561 -0.0836802 -0.0749768 -0.1132355 0.0213621 0.0009441 0.0887976 -0.0091338 0.1115627 -0.0542368 0.0260843 -0.0195299 0.025576 0.1371065 0.0209662 -0.0553196 -0.0210667 -0.1662085 -0.0754277 -0.1000507 -0.0314273 -0.0937527 0.0329733 -0.0863226 0.0019227 0.0104732 -0.0297713 0.0627001 0.0223686 0.2409034 0.0237747 -0.2653992 -0.0001419 0.0564559 -0.0183602 0.1718436 -0.0679915 0.0850077 -0.0214821 0.077567 0.0560895 0.0661106 -0.0521924 -0.0772905 -0.0162596 0.0150993 -0.0804759 -0.041751 -0.0944588 0.0035185 -0.1069339 0.0001846 0.0156532 -0.0646129 0.0882924 0.0073933 0.0230338 0.0036242 0.1177421 0.0856467 -0.0212933 0.0763784 0.0054935 0.0580338 0.0663846 0.0300187 0.0835103 -0.0574863 unknown
polarizability: 124.1078602|9.2122862|99.9125001|-5.5305859|-5.0577204|65.2412002 unknown
InChI: InChI=1S/C8H13NO/c1-7(10)8-3-5-9(2)6-4-8/h3H,4-6H2,1-2H3
charge 0 multiplicity 1
23 atoms
O  -2.75892 -1.203187 0.438418
N  2.161282 0.014126 0.248049
C  1.492028 -1.201387 -0.272053
C  0.073672 -1.322602 0.312858
C  1.473083 1.252822 -0.155497
C  -0.693706 -0.020148 0.15819
C  -0.029857 1.15301 -0.072487
C  3.606511 0.062169 -0.028786
C  -2.185467 -0.085222 0.255894
C  -3.014839 1.194996 0.142224
H  2.097756 -2.078588 0.020213
H  1.43527 -1.194849 -1.392038
H  0.134035 -1.58657 1.385679
H  -0.488389 -2.138785 -0.176733
H  1.736488 1.561539 -1.207527
H  1.820704 2.084285 0.492948
H  -0.579493 2.092048 -0.215837
H  4.052531 0.945179 0.464785
H  3.851202 0.11973 -1.120637
H  4.093621 -0.838943 0.383742
H  -2.741722 1.919577 0.931071
H  -4.079299 0.934792 0.245618
H  -2.859692 1.688208 -0.835195
