program: Gaussian 09
title: 000147030
version: EM64L-G09RevD.01
frameworkgroup: C1[X(C14H22N2O)]
method: RPBEPBE
basis: SDD
operation: Freq
keyword: #p
keyword: freq=noraman
keyword: PBEPBE/SDD
title: #p freq=noraman PBEPBE/SDD
converged: YES YES NO NO
title: Mulliken charges:
elementType: O N N C C C C C C C C C C C C C C H H H H H H H H H H H H H H H H H H H H H H
charge: -0.296515 -0.074801 -0.127110 -0.159982 -0.413890 -0.424660 -0.359480 -0.410037 -0.381235 -0.347208 -0.436636 -0.445019 -0.434111 0.051274 0.226135 -0.086077 -0.801432 0.293958 0.214508 0.216448 0.219923 0.216451 0.202525 0.201060 0.240367 0.230860 0.179160 0.229470 0.230879 0.177621 0.211912 0.228460 0.226811 0.205570 0.215418 0.244978 0.265915 0.231203 0.237289
chargesum: 0.00000
title: Mulliken charges with hydrogens summed into heavy atoms:
elementType: O N N C C C C C C C C C C C C C C
charge: -0.296515 -0.074801 -0.127110 0.133976 0.017066 0.011713 0.044106 0.061190 0.027395 0.061292 0.003736 -0.012638 0.026285 0.051274 0.226135 -0.086077 -0.067026
polarizability: 2.05832727e+02 3.46033634e+00 1.51761493e+02 2.22902675e+00 2.17991806e+00 1.36591414e+02
1716.lowfreq: -11.2222 -0.0005 -0.0005 0.0007 1.2000 5.6380 9.5580 27.9518 34.1361
frequency: -2.2664 27.9197 33.9867 49.9621 68.0297 88.7333 93.8921 110.1987 168.3597 173.6015 193.0432 241.2784 243.1426 292.9658 305.8020 314.6783 324.5907 354.3411 385.5022 409.8159 447.4206 501.2861 537.7487 563.5303 578.7771 605.5704 622.8160 639.9101 724.5822 756.8930 776.6184 817.6902 838.1917 842.8641 863.6965 894.8441 896.9131 910.9676 939.1304 944.7422 971.5654 978.9615 991.6151 1028.9617 1031.0952 1042.6109 1057.0072 1080.5805 1091.7879 1095.5212 1115.9025 1117.9412 1131.6033 1154.6995 1176.3520 1184.1104 1190.2028 1219.2929 1225.1381 1226.7219 1251.2329 1256.4824 1258.4964 1283.0829 1283.9283 1292.9552 1314.4646 1315.9162 1333.3998 1337.4113 1341.7525 1348.6175 1355.8408 1371.8757 1375.2400 1409.3055 1450.6961 1451.5786 1453.8259 1460.5451 1465.9722 1466.3770 1471.2755 1478.4684 1480.2364 1486.4990 1495.2182 1584.5559 2275.0809 2808.7823 2831.6949 2846.9276 2970.7588 2978.9654 2981.3319 2989.4474 2993.7186 2998.4907 3009.6014 3012.4895 3023.8478 3032.8378 3038.8048 3048.1414 3050.7291 3063.4594 3068.3799 3075.8555 3093.0850 3094.0169 3130.6895
redmass: 3.5500 4.6621 3.3368 3.0943 2.3266 2.7405 3.7438 2.9263 2.6553 1.1045 2.7564 2.7565 3.6078 3.6987 2.7751 3.0108 2.3105 3.7756 2.6457 3.6970 3.4814 2.3722 3.6293 4.5098 3.5494 2.9862 2.9922 3.7000 3.0636 1.4954 2.8843 1.8790 1.9828 2.1127 2.0184 2.7224 2.5043 1.5815 2.5975 1.9011 1.6643 1.9508 1.7254 1.7522 1.9508 1.9564 2.5744 1.7183 1.5379 1.5926 2.4253 3.0494 2.9242 1.8382 1.6663 1.2650 1.3257 1.6809 1.2718 1.9264 1.5288 1.3220 1.3438 1.2683 1.2054 1.3188 1.4644 1.3922 1.3717 1.4619 1.4011 1.4151 1.3932 1.4954 1.2180 2.9938 1.0794 1.0881 1.0891 1.0842 1.0995 1.0820 1.0676 1.0799 1.0869 1.0825 1.1044 6.7083 11.8307 1.0709 1.0714 1.0708 1.0707 1.0595 1.0631 1.0382 1.0634 1.0844 1.0811 1.0597 1.0681 1.0833 1.0979 1.1018 1.0879 1.1033 1.1046 1.0984 1.1054 1.0930 1.0980
irintensity: 0.6938 1.6498 0.6360 0.7282 3.0019 1.3409 0.7973 1.3182 3.5278 0.8763 1.5160 4.1915 6.4560 1.6270 2.4752 1.7487 7.2220 3.8994 3.9802 1.9838 5.3763 0.7629 6.2417 11.3969 5.3758 5.0797 0.4958 1.4305 0.5717 0.8691 1.2845 1.2224 17.0316 10.6801 11.8457 5.4480 4.4453 5.3392 18.0463 3.2582 2.0120 47.6268 4.3562 10.6119 8.2064 6.7389 8.4970 1.9392 2.1864 1.3935 14.0638 25.5147 18.2104 7.1622 36.7197 3.7403 3.4344 5.9793 10.2388 19.3150 93.2650 4.4586 27.7121 8.2310 6.0788 11.2635 33.0851 13.5237 5.0782 12.3792 6.9292 6.2729 8.5544 27.4112 28.1817 169.5296 5.1518 33.3218 8.5141 9.9610 24.6015 3.1509 10.9157 0.5059 12.9756 5.6399 2.1633 280.8743 0.0961 56.8786 65.3216 195.0694 24.4328 34.8917 30.9228 8.3893 32.0592 16.4497 23.3148 20.4934 60.9375 66.1954 43.6513 54.2255 25.1304 54.3377 3.1119 17.0584 77.6293 21.1989 10.4369
temp: 298.150 k
press: 1.00000 atm
elementType: 8 7 7 6 6 6 6 6 6 6 6 6 6 6 6 6 6 1 1 1 1 1 1 1 1 1 1 1 1 1 1 1 1 1 1 1 1 1 1
symmnumber: 1
zpe: 885165.4 jmol-1
zpe.correction: 0.337142 hartree
zpe.thermalcorrener: 0.354005 hartree
zpe.thermalcorrenthalpy: 0.354949 hartree
zpe.thermalcorrgfe: 0.291113 hartree
zpe.sumelectzpe: -730.026447 hartree
zpe.sumelectthermal: -730.009584 hartree
zpe.sumelectthermalent: -730.008640 hartree
zpe.sumelectthermalfe: -730.072476 hartree
dipole: 2.9182 2.9753 1.9226
dipole: 4.5896
quadrupole: -102.9793 -104.0671 -101.0026
quadrupole: -12.9623 -11.6542 -3.8742
quadrupole: -0.2963 -1.3841 1.6804 -12.9623 -11.6542 -3.8742
hfenergy: -730.3635891 hartree
pointgroup: C01[X(C14H22N2O1)]
dipole: -0.9514698 0.0580147 -1.5335652 debye
polarizability: 202.0580633|-10.2177967|139.8247423|10.4472743|-6.9855847|152.3028284 unknown
InChI: InChI=1S/C14H22N2O/c1-13(17)16-12-3-2-7-14(16)8-6-11-15-9-4-5-10-15/h14H,2-5,7,9-12H2,1H3
charge 0 multiplicity 1
39 atoms
O  3.672164 -0.782291 2.335599
N  -3.0346 0.084322 0.045318
N  2.483738 -0.662938 0.339414
C  1.863286 0.627134 0.765678
C  2.204774 1.726116 -0.283601
C  1.776397 1.295652 -1.705101
C  2.399429 -0.071678 -2.077629
C  2.079883 -1.138287 -1.000145
C  -4.485636 -0.163218 0.259869
C  -2.973955 1.266045 -0.853055
C  -5.121864 0.095332 -1.13474
C  -4.058213 0.94715 -1.909576
C  -2.269633 0.209209 1.307714
C  0.402322 0.479042 0.958064
C  3.370488 -1.293432 1.208874
C  -0.817888 0.35806 1.097528
C  3.974688 -2.624917 0.761434
H  2.336417 0.870186 1.736573
H  3.298639 1.894525 -0.251883
H  1.708043 2.670354 0.004844
H  2.074265 2.065415 -2.441442
H  0.670987 1.219215 -1.744368
H  2.015389 -0.419254 -3.056013
H  3.498889 0.032943 -2.169396
H  0.988796 -1.339789 -0.991709
H  2.593013 -2.084805 -1.22824
H  -4.914949 0.547299 1.013772
H  -4.653433 -1.190534 0.63021
H  -1.962085 1.379639 -1.278621
H  -3.225153 2.212311 -0.305723
H  -6.085233 0.625355 -1.036135
H  -5.315846 -0.853484 -1.662816
H  -3.619942 0.353616 -2.729882
H  -4.485961 1.866616 -2.345651
H  -2.632571 1.076148 1.923925
H  -2.454448 -0.702347 1.909714
H  4.631634 -2.974716 1.571043
H  4.575064 -2.518958 -0.160586
H  3.197005 -3.388638 0.578841
