program: Gaussian 09
title: 000146955
version: EM64L-G09RevD.01
frameworkgroup: C1[X(C6H11BrN2O2)]
method: RPBEPBE
basis: SDD
operation: Freq
keyword: #p
keyword: freq=noraman
keyword: PBEPBE/SDD
title: #p freq=noraman PBEPBE/SDD
converged: YES YES NO NO
title: Mulliken charges:
elementType: Br O O N N C C C C C C H H H H H H H H H H H
charge: -0.031876 -0.178825 -0.213234 -0.440886 -0.641637 -0.018290 -0.622395 -0.702833 -0.691141 0.340083 0.277388 0.259105 0.303719 0.199119 0.271355 0.223205 0.207009 0.220586 0.242538 0.325424 0.321584 0.350002
chargesum: 0.00000
title: Mulliken charges with hydrogens summed into heavy atoms:
elementType: Br O O N N C C C C C C
charge: -0.031876 -0.178825 -0.213234 -0.115462 0.029950 0.240815 -0.318676 -0.009153 -0.021009 0.340083 0.277388
polarizability: 1.18874587e+02 1.86845069e+00 1.22051268e+02 2.61173498e+00 3.93487770e+00 6.85499956e+01
1716.lowfreq: -0.9450 -0.0007 -0.0006 -0.0003 4.8656 7.4103 26.0988 43.3646 62.3186
frequency: 26.0797 43.3543 62.2750 88.1773 120.8898 149.7160 168.6810 194.3189 210.2506 257.8688 275.6417 308.5927 384.9557 406.8737 420.1208 449.1614 537.5461 550.0151 566.4103 608.8671 696.4927 732.0164 757.5446 832.2462 900.3545 915.5593 927.7745 962.1317 981.7346 1059.7313 1099.2417 1113.8647 1141.2179 1174.9736 1187.8938 1256.2947 1291.4494 1298.4233 1353.1594 1379.5135 1398.7975 1443.8600 1462.4744 1473.9404 1478.1779 1495.2083 1608.9939 1640.5837 1699.5103 2978.3303 2981.5756 3023.0667 3042.5073 3068.7812 3078.7611 3096.2882 3111.6619 3505.6551 3528.1644 3681.3159
redmass: 5.3352 6.2317 2.8368 4.7226 5.3521 3.6417 4.9659 1.3183 1.4107 3.3531 3.3366 3.4237 3.0048 2.1707 2.1452 1.7475 4.1510 3.6989 1.2315 1.1959 5.6578 6.1693 6.4399 2.6613 3.4545 3.3914 1.1904 1.4340 2.3387 1.9557 1.8290 1.8088 1.5545 2.0237 1.9055 1.4753 1.3707 3.4655 1.4340 1.1955 1.2068 2.0232 1.0583 1.0439 1.0555 1.0508 1.2061 5.3458 7.0097 1.0377 1.0385 1.0831 1.0869 1.0983 1.0971 1.0990 1.0989 1.0762 1.0463 1.1040
irintensity: 13.6471 6.1003 1.7049 1.1777 3.1541 0.3039 0.2043 0.1766 0.1040 3.2063 6.1575 3.0149 3.4234 7.6153 16.1016 54.6726 43.1019 25.8061 245.3406 74.0332 64.5705 21.4315 3.0877 5.5014 5.6809 43.3163 7.8810 7.1212 9.7616 11.9610 9.5746 36.0478 69.2894 21.6802 80.4685 44.8874 2.9558 144.7563 2.3349 17.0702 30.9392 660.9766 25.4508 4.8963 14.5967 25.7924 59.7267 35.8931 376.5244 16.0147 40.8626 2.2957 5.3205 1.0158 72.2424 22.7359 13.5115 13.4285 48.7955 35.5337
temp: 298.150 k
press: 1.00000 atm
elementType: 35 8 8 7 7 6 6 6 6 6 6 1 1 1 1 1 1 1 1 1 1 1
symmnumber: 1
zpe: 452721.2 jmol-1
zpe.correction: 0.172432 hartree
zpe.thermalcorrener: 0.185715 hartree
zpe.thermalcorrenthalpy: 0.186660 hartree
zpe.thermalcorrgfe: 0.130506 hartree
zpe.sumelectzpe: -507.807063 hartree
zpe.sumelectthermal: -507.793780 hartree
zpe.sumelectthermalent: -507.792836 hartree
zpe.sumelectthermalfe: -507.848989 hartree
dipole: 0.5031 -3.6256 -3.5004
dipole: 5.0646
quadrupole: -69.4914 -77.5422 -77.6072
quadrupole: 20.5825 5.0118 -2.1099
quadrupole: 5.3889 -2.6620 -2.7269 20.5825 5.0118 -2.1099
hfenergy: -507.9794951 hartree
pointgroup: C01 [X(C6H11Br1N2O2)]
dipole: -0.0076399 1.4352804 1.3821352 debye
dipolederiv: -0.2448778 0.0234497 -0.0122335 -0.004068 -0.6766561 0.0556515 -0.0007868 0.0743853 -0.1588892 -0.6177623 -0.0647051 -0.0146819 0.3038835 -0.4839479 -0.2556971 0.246877 -0.311616 -0.5819805 -0.7273836 -0.1624688 -0.029361 -0.1594341 -0.9059305 -0.12257 -0.1341258 -0.1163813 -0.335161 -2.0436445 -0.0347179 0.3113162 -0.0806903 -0.400035 0.0030606 0.2323778 -0.0183401 -0.432258 -0.9323021 0.4174822 0.1348547 0.4806602 -0.6428892 -0.1055451 0.1609889 -0.1246903 -0.7984438 0.0864071 -0.0591911 0.0079647 0.0686272 -0.1960896 0.0277619 -0.0868694 0.1383414 0.0557568 -0.0113655 -0.2564691 0.009427 -0.2372058 0.8466985 -0.1956586 -0.0962755 -0.204699 0.1297574 -0.0864842 0.13008 -0.0281744 -0.039164 -0.0192773 0.0180469 0.0636181 -0.0990699 0.1152854 -0.06375 -0.0576211 -0.0153927 0.0054777 -0.0024933 -0.0022395 0.0181319 -0.0084581 0.1137832 1.6319203 0.193611 -0.2879129 -0.4494612 0.4509729 0.4726887 -0.5194748 0.4960475 0.7067982 2.2691831 -0.1173117 -0.171764 0.0786345 1.4406822 0.2420231 0.17171 0.2894188 0.3599851 0.0716689 0.0037315 -0.0350224 0.012325 0.0530813 0.009287 -0.007586 0.0012483 -0.0888372 0.0196572 -0.0098827 0.0137695 -0.003048 -0.0479979 0.0584312 0.0246717 -0.0006838 -0.0837311 0.0969118 0.0020255 0.0017462 -0.0126494 0.0736028 -0.0514941 -0.0196716 0.0367495 -0.167096 -0.0000624 -0.1349896 -0.0312202 -0.1189732 0.0607589 -0.0006472 -0.0188243 -0.0358971 0.0783257 -0.0798557 0.1239156 0.0633325 0.11197 -0.0272113 -0.0041568 0.0627834 -0.0077961 0.0681504 0.071878 -0.014304 0.0393393 -0.022423 0.0829688 -0.0057742 -0.0432957 -0.0322567 -0.1681358 -0.1047319 0.0924638 0.0336535 0.1450168 0.0137885 -0.0519844 0.0575884 -0.0498703 0.0718255 0.1013332 -0.0097282 -0.0118492 -0.0699278 -0.0932215 0.0765724 -0.0017843 0.0798293 0.0564356 0.1562666 -0.0058446 0.0099414 0.0457777 0.1688538 -0.1179561 -0.090613 -0.0909127 0.2694042 0.195511 -0.0357224 0.0170201 -0.0561199 0.1260879 -0.0128892 -0.0239009 0.016463 0.4040023 0.2114829 -0.023803 -0.0047529 0.000792 0.1782538 -0.0369112 0.0044608 -0.0318117 0.3850229 unknown
polarizability: 119.3701509|-2.1813464|121.3187908|-4.6376612|3.6550853|68.7869089 unknown
InChI: InChI=1S/C6H11BrN2O2/c1-3(2)4(7)5(10)9-6(8)11/h3-4,9H,8H2,1-2H3
charge 0 multiplicity 1
22 atoms
Br 1.145987 2.412755 -0.027373
O  -0.215434 -0.999683 -1.044595
O  -2.966151 -1.320458 0.054743
N  -1.322933 0.329124 0.550161
N  -3.60761 0.832968 0.688085
C  2.398187 -0.336601 -0.043282
C  1.143303 0.389277 0.465371
C  2.374272 -1.792155 0.512339
C  3.710752 0.362411 0.374342
C  -0.183527 -0.173465 -0.102787
C  -2.668391 -0.149296 0.383327
H  2.334594 -0.38821 -1.146195
H  1.12247 0.428915 1.57016
H  2.411121 -1.796495 1.619022
H  1.481423 -2.343627 0.177978
H  3.265792 -2.331942 0.146186
H  3.774186 0.470654 1.474416
H  4.573247 -0.244823 0.045998
H  3.806157 1.365035 -0.074712
H  -1.17868 1.13218 1.16955
H  -3.381366 1.825818 0.722599
H  -4.586803 0.55432 0.665868
