program: Gaussian 09
title: 000147012
version: EM64L-G09RevD.01
frameworkgroup: C1[X(C19H26O2)]
method: RPBEPBE
basis: SDD
operation: Freq
keyword: #pfreq=noraman
keyword: PBEPBE/SDD
title: #p freq=noraman PBEPBE/SDD
converged: YES YES NO NO
title: Mulliken charges:
elementType: O O C C C C C C C C C C C C C C C C C C C H H H H H H H H H H H H H H H H H H H H H H H H H H
charge: -0.144204 -0.191290 -0.095288 0.443747 -0.148157 -0.074954 0.182707 -0.538447 -0.527613 -0.572900 -0.564325 -0.480860 -0.421949 0.568008 -0.639548 -0.815835 -0.604102 -0.783566 -0.568443 0.020917 0.098675 0.200045 0.233897 0.201012 0.203063 0.211221 0.219648 0.226680 0.213642 0.228370 0.221563 0.215561 0.230692 0.218970 0.217522 0.212355 0.227210 0.239040 0.232390 0.218687 0.220872 0.251965 0.254141 0.221568 0.235608 0.242177 0.259531
chargesum: 0.00000
title: Mulliken charges with hydrogens summed into heavy atoms:
elementType: O O C C C C C C C C C C C C C C C C C C C
charge: -0.144204 -0.191290 0.104757 0.443747 0.085739 0.126058 0.182707 -0.124164 -0.081285 -0.130888 -0.127201 -0.031199 0.007928 0.568008 -0.173298 -0.143886 -0.097996 -0.084213 -0.308912 0.020917 0.098675
polarizability: 2.70757137e+02 -3.25267832e+00 1.87777501e+02 -9.79759194e+00 -1.35224665e+00 1.50945440e+02
1716.lowfreq: -12.6270 -0.0009 -0.0007 -0.0004 4.7066 22.2801 38.4842 42.6894 80.6294
frequency: 37.9045 42.4458 80.6222 96.2770 130.9166 136.2415 147.0821 186.1823 204.9273 211.9576 221.2604 239.0662 259.0388 262.9403 275.1165 300.1531 305.9168 321.9628 346.7725 356.4171 390.5342 404.9234 419.1286 425.2530 442.1027 460.7178 502.4241 525.2091 530.6336 573.3235 593.9521 629.4251 665.2324 674.3110 694.5832 723.7781 743.3360 758.8353 797.5978 810.3702 833.5559 851.1664 872.0169 888.8910 897.7888 911.1592 916.8827 932.9727 940.6167 946.7423 952.9701 984.0170 1000.5075 1007.6328 1015.6276 1027.6200 1035.6009 1065.5474 1076.1170 1080.5267 1104.6095 1116.4915 1127.6572 1129.5711 1133.6204 1139.6377 1162.9665 1173.3437 1179.0187 1192.6687 1202.1993 1208.8837 1218.8419 1220.5080 1239.8805 1249.7146 1262.9609 1267.0032 1277.8149 1286.4395 1293.3485 1295.7960 1298.1679 1311.1340 1320.7742 1325.1371 1332.4011 1338.4817 1345.4618 1349.7962 1355.2963 1369.5499 1385.6721 1392.8521 1435.7703 1453.9701 1457.9857 1463.6159 1469.1179 1469.7427 1472.0044 1478.8229 1483.3007 1485.5305 1490.2104 1493.2610 1574.7178 1613.2745 1636.0601 2906.5170 2915.6021 2954.1213 2956.9660 2959.3679 2959.7861 2972.5367 2979.2352 2982.1776 2985.3923 2987.9990 2991.2449 3009.8254 3021.0184 3038.0653 3038.9062 3042.4240 3044.9662 3049.0659 3068.8532 3072.4255 3074.9604 3082.0033 3083.2389 3092.3483 3118.2817
redmass: 5.7776 5.0515 3.9534 3.2428 2.7988 2.5279 2.2436 2.1864 3.0673 1.3289 1.7290 1.9504 2.6536 2.6055 1.9962 3.3607 3.3502 8.0163 2.9365 2.2442 2.7352 3.9183 2.4705 3.3903 3.7458 3.7891 2.4468 2.6060 3.7959 2.8708 3.3390 3.1823 4.5657 3.7309 3.3397 1.8746 3.1162 3.1009 1.7272 2.1522 1.8833 1.9134 1.8753 2.1294 2.1761 1.7020 1.9177 1.8047 1.7551 1.9664 1.9093 1.8890 1.9179 2.6173 2.5428 1.8142 1.8396 2.1457 2.1724 2.2357 2.7119 1.9514 1.8890 1.7539 1.9197 2.5027 2.3110 1.3277 1.5682 1.9004 2.6169 1.4898 1.2205 1.6304 1.5276 1.4371 1.4303 2.2191 1.4787 1.3838 1.4488 1.4857 1.4483 1.5180 1.4909 1.4079 1.3359 1.4666 1.8433 1.4870 1.3957 1.5051 1.2079 1.1939 1.0898 1.0870 1.0738 1.0803 1.0880 1.0760 1.0845 1.0545 1.0712 1.0595 1.0903 1.0602 11.0646 8.0482 10.7082 1.0810 1.0804 1.0662 1.0788 1.0659 1.0613 1.0644 1.0535 1.0475 1.0608 1.0499 1.0460 1.0641 1.0977 1.0997 1.0954 1.0997 1.1018 1.1004 1.0976 1.1038 1.0943 1.0986 1.0992 1.0993 1.0912
irintensity: 2.2139 0.3004 1.6237 1.6017 0.9908 1.2353 0.2253 1.5066 0.7283 0.0094 0.6878 0.1247 0.3204 0.2862 0.1673 0.4733 1.1730 4.7183 1.8745 0.3150 0.7889 0.7788 0.1624 0.2098 2.7306 1.4627 0.4444 1.7647 0.8193 3.3416 1.8686 0.9137 3.1843 5.7712 1.5331 5.8398 1.5748 1.3361 2.1806 0.7947 3.3544 3.5319 11.5010 5.3752 3.2366 16.7817 5.2185 11.6267 2.8174 3.8897 7.7408 4.5550 4.6038 6.6511 2.0468 3.1298 0.2009 5.5608 0.3317 2.1904 0.9736 4.6489 7.0855 4.0357 2.5201 19.3969 1.7422 7.5132 9.9160 3.5453 5.0897 0.7907 4.6613 3.1470 0.9771 8.8479 7.4284 94.0409 17.6527 2.0265 2.0007 1.5973 0.7541 0.8064 3.3553 0.4044 0.2480 2.5929 0.2795 3.7919 4.9445 4.6166 21.6707 24.3615 9.0382 24.5474 1.7688 4.4633 6.1865 8.9973 15.2236 4.2879 3.3480 3.1924 8.4822 7.0028 146.6904 290.1920 63.3895 8.6510 17.8508 13.0424 6.5355 10.7638 35.4796 41.4631 36.5702 31.1386 38.2093 8.0067 34.8812 56.2078 38.8155 13.9920 49.7393 16.0221 60.1447 20.9930 39.5109 80.1576 10.9553 63.8929 6.8535 23.3394 9.3949
temp: 298.150 k
press: 1.00000 atm
elementType: 8 8 6 6 6 6 6 6 6 6 6 6 6 6 6 6 6 6 6 6 6 1 1 1 1 1 1 1 1 1 1 1 1 1 1 1 1 1 1 1 1 1 1 1 1 1 1
symmnumber: 1
zpe: 1068500.0 jmol-1
zpe.correction: 0.406970 hartree
zpe.thermalcorrener: 0.426168 hartree
zpe.thermalcorrenthalpy: 0.427112 hartree
zpe.thermalcorrgfe: 0.361032 hartree
zpe.sumelectzpe: -888.454873 hartree
zpe.sumelectthermal: -888.435675 hartree
zpe.sumelectthermalent: -888.434731 hartree
zpe.sumelectthermalfe: -888.500811 hartree
dipole: -7.9869 1.5319 1.0147
dipole: 8.1955
quadrupole: -175.6888 -126.3558 -124.6059
quadrupole: 6.2649 5.1511 2.1728
quadrupole: -33.4720 15.8610 17.6109 6.2649 5.1511 2.1728
hfenergy: -888.8618433 hartree
pointgroup: C01[X(C19H26O2)]
dipole: 3.1397138 -0.6226469 0.388588 debye
polarizability: 270.7198344|-3.7681515|187.7360772|9.7972407|2.0510293|151.024166 unknown
InChI: InChI=1S/C19H26O2/c1-18-8-3-4-14(18)13-6-5-12-10-16(20)17(21)11-19(12,2)15(13)7-9-18/h10,13-15H,3-9,11H2,1-2H3
charge 0 multiplicity 1
47 atoms
O  -4.481229 1.92115 0.091497
O  -5.238856 -0.715395 -0.887522
C  2.557518 -0.551704 -0.359834
C  3.209272 0.842895 -0.095219
C  1.183699 -0.733752 0.319049
C  0.224587 0.388942 -0.196026
C  -1.243346 0.287112 0.39564
C  2.26062 1.925204 -0.661027
C  0.842236 1.808842 -0.038714
C  3.696468 -1.560397 -0.068623
C  4.558536 0.665274 -0.847014
C  0.582125 -2.124726 0.019077
C  4.994918 -0.810464 -0.53896
C  -1.764931 -1.14817 0.217041
C  -0.834472 -2.274001 0.622363
C  3.50615 1.108029 1.406783
C  -2.158468 1.2975 -0.373913
C  -1.292993 0.629787 1.919959
C  -3.034044 -1.434106 -0.229511
C  -3.647818 1.035436 -0.218613
C  -4.069889 -0.424719 -0.497517
H  2.370563 -0.588945 -1.459244
H  1.309173 -0.640398 1.419045
H  0.117101 0.204906 -1.291392
H  2.189333 1.803567 -1.762311
H  2.660589 2.941684 -0.4743
H  0.897903 2.079977 1.032494
H  0.185268 2.55865 -0.517568
H  3.557587 -2.517714 -0.601656
H  3.744475 -1.796614 1.011893
H  5.322182 1.401113 -0.534764
H  4.398263 0.797775 -1.935351
H  1.236944 -2.918797 0.424384
H  0.53509 -2.27312 -1.079546
H  5.771132 -0.839083 0.246868
H  5.431822 -1.287172 -1.434578
H  -0.740203 -2.269788 1.729749
H  -1.278512 -3.248244 0.348753
H  4.203105 0.359241 1.823441
H  3.980017 2.101379 1.520345
H  2.598063 1.100844 2.034375
H  -1.929614 1.213447 -1.458421
H  -1.954254 2.335612 -0.062779
H  -0.622517 -0.019007 2.509364
H  -0.996141 1.67797 2.094625
H  -2.318437 0.504486 2.311314
H  -3.353919 -2.477903 -0.347058
