program: Gaussian 09
title: 000010141
version: EM64L-G09RevD.01
frameworkgroup: C1[X(C10H6O4)]
method: RPBEPBE
basis: SDD
operation: Freq
keyword: #pfreq=noraman
keyword: PBEPBE/SDD
title: #p freq=noraman PBEPBE/SDD
converged: YES YES NO NO
title: Mulliken charges:
elementType: O O O O C C C C C C C C C C H H H H H H
charge: -0.382312 -0.363182 -0.319971 -0.176414 0.118975 0.181863 0.117001 0.161418 0.126902 0.012904 -0.330341 -0.366755 -0.294588 -0.267288 0.268920 0.230259 0.267575 0.265219 0.387347 0.362468
chargesum: 0.00000
title: Mulliken charges with hydrogens summed into heavy atoms:
elementType: O O O O C C C C C C C C C C
charge: 0.005035 -0.000714 -0.319971 -0.176414 0.118975 0.181863 0.117001 0.161418 0.126902 0.012904 -0.061421 -0.136495 -0.027013 -0.002069
polarizability: 1.67086545e+02 7.90842579e-02 1.75937600e+02 -8.01375305e-03 -2.72328619e-03 4.62796631e+01
1716.lowfreq: -8.6898 -6.7881 -5.8019 -0.0008 -0.0005 -0.0003 69.4300 102.5653 157.9111
frequency: 69.4287 102.5651 157.9111 194.5442 261.5949 281.6872 349.6360 354.6209 373.7029 403.9314 406.1910 436.9580 451.0376 465.5650 477.7657 531.6326 588.8941 618.6219 644.0195 691.4231 713.1036 748.1197 786.3469 817.0857 860.9058 904.9887 926.1066 944.4269 971.9938 1000.7748 1076.7741 1087.9442 1156.9716 1164.2642 1236.2419 1265.7595 1277.5082 1288.7435 1350.8831 1370.9712 1409.3830 1431.4359 1457.2044 1517.2432 1551.5499 1584.7787 1602.6488 1641.0283 2628.3245 3120.9741 3147.5169 3172.9728 3182.0841 3536.7978
redmass: 8.4117 6.0509 7.7044 5.8896 8.1042 4.6518 5.8342 5.4427 9.6872 1.1361 9.1590 11.2206 9.9268 5.7101 5.3797 3.0660 6.5378 4.2945 2.5877 5.7820 7.1310 6.4876 6.4643 1.5969 1.9615 7.6732 6.4698 1.3305 1.0705 1.3162 1.7287 3.0365 1.2550 1.2754 1.8524 4.0836 2.4557 3.4174 1.7870 5.5058 7.9272 5.4254 2.5196 6.6091 5.6633 3.4173 6.5611 6.2996 1.0731 1.0904 1.0872 1.1002 1.0954 1.0658
irintensity: 8.2040 5.5867 0.0005 2.7695 2.7384 1.8706 19.0849 0.0086 4.9558 115.7836 7.1973 17.8534 1.0027 0.1504 2.9585 4.6165 12.9361 5.7940 33.3054 0.6769 4.0622 6.9668 4.7833 51.7261 43.7545 62.9775 5.7579 6.0337 126.5105 0.0106 59.0496 19.8500 79.5194 100.2288 133.4010 85.2573 62.8587 71.1219 53.7403 138.0112 8.1838 114.3280 86.7878 148.7684 141.4975 40.8385 5.0069 5.6900 103.2178 11.7346 0.2016 10.1795 2.2310 51.2516
temp: 298.150 k
press: 1.00000 atm
elementType: 8 8 8 8 6 6 6 6 6 6 6 6 6 6 1 1 1 1 1 1
symmnumber: 1
zpe: 357657.0 jmol-1
zpe.correction: 0.136224 hartree
zpe.thermalcorrener: 0.147004 hartree
zpe.thermalcorrenthalpy: 0.147948 hartree
zpe.thermalcorrgfe: 0.099872 hartree
zpe.sumelectzpe: -684.579483 hartree
zpe.sumelectthermal: -684.568704 hartree
zpe.sumelectthermalent: -684.567760 hartree
zpe.sumelectthermalfe: -684.615836 hartree
dipole: -1.0557 -2.6915 0.0004
dipole: 2.8912
quadrupole: -94.1781 -62.4491 -80.9821
quadrupole: 14.1299 0.0009 -0.0012
quadrupole: -14.9750 16.7540 -1.7790 14.1299 0.0009 -0.0012
hfenergy: -684.7157075 hartree
pointgroup: C01 [X(C10H6O4)]
dipole: 0.3380396 -1.0860871 -0.0001581 debye
dipolederiv: -1.1902972 -0.4182687 0.0000161 0.0169924 -0.2914513 -0.00001 0.0000281 0.0000332 -0.3769871 -1.2364201 0.6720988 0.0000841 0.1583697 -0.0553491 0.0000108 0.000078 -0.0000335 -0.3654254 -1.0331296 0.5602426 0.0001458 -0.0344477 -0.4442774 -0.0000028 0.0000041 0.0000131 -0.3515082 -0.7310302 -0.5032252 -0.0000823 -0.0671644 -0.4672403 0.0000074 0.0000374 0.0000809 -0.3089543 -0.1915297 0.3851431 0.0000187 0.0237421 -0.8446845 -0.0000288 0.0000225 -0.000081 -0.0374831 -0.1186252 -0.3855558 -0.0000081 0.0096226 -0.6651609 -0.0000156 0.0000069 0.0000057 0.0130353 1.0762964 0.4352701 -0.0000064 -0.2569343 -0.0937045 0.0000155 -0.0000103 -0.0000666 0.1072373 1.1546608 -0.6441295 -0.0001062 -0.0417138 -0.2300221 -0.0000055 -0.000101 0.0000099 0.081103 0.9586526 -0.5149942 -0.0001566 0.1552527 0.9822952 -0.0000249 -0.0001158 0.0000015 0.188372 0.7503717 0.4581113 0.0000612 -0.1247142 0.9000118 -0.000015 0.0000244 -0.0000536 0.1728049 -0.1584592 -0.3380974 -0.0000159 0.2931226 0.3579842 0.0000208 0.0000032 0.0000538 -0.1313998 -0.1338104 0.4060637 0.0000158 -0.2212793 0.3814873 0.0000517 -0.0000095 0.0000186 -0.145774 -0.2014422 -0.1813598 0.0000558 -0.2861546 0.0555449 0.0000096 -0.0000125 -0.00001 -0.1403128 -0.0077431 0.1310924 -0.000039 0.2118461 0.0843859 -0.0000179 0.0000202 0.0000131 -0.0843065 0.0647314 -0.0722192 0. -0.0396648 0.0174136 -0.0000093 -0.0000066 -0.0000145 0.1664451 0.0050481 0.1312305 0.0000212 0.070442 -0.0247496 -0.0000177 0.0000235 -0.0000185 0.1624162 0.0489681 0.0927 0.0000025 0.0318292 -0.0153373 0.0000252 0.0000203 0.0000231 0.1585439 0.0621324 -0.0838362 0.0000074 -0.0206863 -0.0191415 0.0000251 -0.0000054 0.0000203 0.152034 0.451994 -0.0057286 -0.000006 0.0981758 0.2660042 0.0000039 -0.0000056 0.0000095 0.3621014 0.4296315 -0.1245379 -0.0000082 0.0233642 0.1059916 -0.0000227 -0.000002 -0.000005 0.3780582 unknown
polarizability: 167.1210544|0.557233|175.9030901|-0.0077969|0.0032931|46.2796631 unknown
InChI: InChI=1S/C10H6O4/c11-5-1-2-6(12)10-8(14)4-3-7(13)9(5)10/h1-4,11-12H
charge 0 multiplicity 1
20 atoms
O  -2.791985 -1.278856 0.000378
O  2.813047 -1.323998 0.000069
O  -2.745223 1.22902 0.000506
O  2.755725 1.388298 0.00012
C  -0.68392 -0.02502 0.000407
C  0.756649 -0.027067 0.000318
C  -1.423222 -1.252932 0.000362
C  1.422727 -1.281736 0.00018
C  -1.442141 1.231844 0.000575
C  1.486281 1.274218 0.000389
C  -0.724243 -2.493247 0.000237
C  0.67029 -2.499012 0.000137
C  -0.709624 2.502341 0.000275
C  0.658226 2.514387 0.0002
H  -1.30406 -3.419775 0.000192
H  1.205352 -3.457628 0.00002
H  -1.310435 3.417455 0.000158
H  1.229649 3.449302 0.000043
H  -3.112698 -0.283945 0.000359
H  3.134204 -2.262649 -0.000024
