program: Gaussian 09
title: 000146947
version: EM64L-G09RevD.01
frameworkgroup: C1[X(C18H14O)]
method: RPBEPBE
basis: SDD
operation: Freq
keyword: #pfreq=noraman
keyword: PBEPBE/SDD
title: #p freq=noraman PBEPBE/SDD
converged: NO NO NO NO
title: Mulliken charges:
elementType: O C C C C C C C C C C C C C C C C C C H H H H H H H H H H H H H H
charge: -0.226294 -0.136577 0.344348 -0.547410 0.307145 0.136353 -0.518668 0.049326 0.411813 -0.681469 0.201260 -0.466791 0.423659 -0.511489 -0.899225 -0.341215 -0.454364 -0.286036 -0.252298 0.239136 0.239323 0.252296 0.252519 0.240879 0.308097 0.240608 0.239829 0.239848 0.248538 0.242991 0.245555 0.226175 0.232137
chargesum: 0.00000
title: Mulliken charges with hydrogens summed into heavy atoms:
elementType: O C C C C C C C C C C C C C C C C C C
charge: -0.226294 -0.136577 0.344348 -0.068951 0.307145 0.136353 -0.013853 0.049326 0.411813 -0.440590 0.201260 -0.158694 0.423659 -0.270882 -0.171011 -0.098223 -0.208809 -0.059860 -0.020161
polarizability: 3.33887379e+02 -5.64065753e+00 2.20903428e+02 9.26184968e-03 9.92987450e-03 8.65681338e+01
1716.lowfreq: -0.0009 -0.0006 -0.0004 5.7134 8.8108 9.8429 17.2679 66.9526 78.1218
frequency: 6.7913 66.9121 78.0999 89.0104 169.5256 178.3758 211.7710 242.7862 265.8517 319.0165 330.4890 352.6663 356.4350 410.1303 416.2963 485.3300 491.5308 507.1314 525.3255 534.1943 539.9522 552.2088 613.5047 621.8653 639.9546 646.7652 681.2710 723.5232 740.5405 760.6070 809.5407 812.3874 834.1187 845.1405 869.8062 884.1681 897.8343 959.3931 963.4131 977.7971 990.7450 999.7728 1007.7370 1022.0576 1024.7688 1039.8945 1047.4071 1053.3120 1117.5965 1137.6110 1153.2264 1181.0276 1185.6279 1200.3435 1216.2915 1235.6829 1249.5593 1261.7289 1274.5057 1295.8484 1311.9528 1364.5586 1375.1980 1392.7917 1400.0803 1409.8984 1424.2282 1434.9322 1454.8301 1459.8470 1488.4218 1497.4396 1503.5706 1539.1863 1579.8870 1592.6247 1611.2862 1619.1008 1632.3127 2976.7095 2994.0960 3018.0247 3041.5551 3061.4687 3076.8855 3077.8390 3121.8023 3123.7033 3127.2216 3133.8138 3159.1763 3162.8983 3259.7718
redmass: 3.3243 4.3722 2.3247 3.3697 3.2032 6.1738 4.1794 4.1748 6.6459 3.4606 2.0177 5.9393 1.7820 4.6775 2.5500 3.1279 5.4960 5.5824 3.1749 2.9319 5.2510 5.3872 5.6628 3.0323 2.7892 7.2514 5.6607 5.2236 2.5855 1.3138 5.9884 1.9313 1.5420 5.4290 2.0693 1.4889 1.7272 1.3976 5.5153 2.8617 1.3401 2.0724 2.6808 1.3470 4.1548 2.0889 1.6089 2.3096 3.0486 1.2188 1.8286 1.2217 1.5117 1.1149 1.4049 2.1402 1.6466 1.7484 2.0406 2.2116 2.7483 3.9334 5.1243 6.2064 1.4261 2.1549 2.0437 1.2553 1.7368 1.2879 1.0487 1.1493 3.6130 4.0555 7.6949 7.2240 8.3354 6.5978 7.2422 1.0374 1.0597 1.0617 1.1024 1.0984 1.1018 1.0976 1.0870 1.0912 1.0892 1.0911 1.0996 1.0971 1.0888
irintensity: 0.0018 4.1627 0.0648 0.8327 2.2349 3.2172 4.8574 0.3295 2.2130 0.7038 2.2259 0.9672 3.1633 1.1052 1.0307 4.7308 1.6728 10.4431 0.1924 0.5598 2.1936 6.1882 4.6000 5.1676 0.5503 7.0196 0.1335 10.1991 7.1380 67.9607 0.8719 0.0023 8.6331 7.0684 11.4216 7.4477 46.4423 5.4316 6.9054 3.5332 0.5503 0.0063 12.3339 0.5864 9.6858 2.1170 7.9109 23.6900 29.8097 0.4543 40.9364 8.5159 35.9602 0.0214 5.0962 3.1225 24.4651 28.7514 1.1587 35.3469 27.6974 11.2642 1.1175 3.0930 4.2917 26.0517 11.1067 0.7511 29.4578 8.6028 14.3525 23.7421 32.9002 8.6595 147.4057 68.3314 123.4983 31.2742 35.2879 22.4479 27.2257 16.3276 7.6775 12.0912 13.1361 26.3683 0.4508 23.5322 8.2178 23.5077 37.5576 19.3565 8.6365
temp: 298.150 k
press: 1.00000 atm
elementType: 8 6 6 6 6 6 6 6 6 6 6 6 6 6 6 6 6 6 6 1 1 1 1 1 1 1 1 1 1 1 1 1 1
symmnumber: 1
zpe: 691042.7 jmol-1
zpe.correction: 0.263204 hartree
zpe.thermalcorrener: 0.277720 hartree
zpe.thermalcorrenthalpy: 0.278664 hartree
zpe.thermalcorrgfe: 0.220113 hartree
zpe.sumelectzpe: -768.281554 hartree
zpe.sumelectthermal: -768.267038 hartree
zpe.sumelectthermalent: -768.266094 hartree
zpe.sumelectthermalfe: -768.324645 hartree
dipole: 0.8854 4.1077 -0.0011
dipole: 4.2020
quadrupole: -94.9259 -105.7108 -114.5091
quadrupole: -11.9607 0.0029 0.0038
quadrupole: 10.1227 -0.6622 -9.4605 -11.9607 0.0029 0.0038
hfenergy: -768.5447581 hartree
pointgroup: C01 [X(C18H14O1)]
dipole: 0.3251682 -1.6209169 0.0004512 debye
polarizability: 334.0257852|4.0199726|220.7650216|-0.0091187|0.0100615|86.5681338 unknown
InChI: InChI=1S/C18H14O/c1-11-10-13-7-9-16(19)18(13)15-8-6-12-4-2-3-5-14(12)17(11)15/h2-6,8,10H,7,9H2,1H3
charge 0 multiplicity 1
33 atoms
O  -3.070289 2.500489 -0.000545
C  -1.976667 0.271747 0.000616
C  -2.481216 -1.038082 0.000287
C  -4.002506 -1.079201 0.001529
C  -0.56425 0.526095 0.000431
C  0.377686 -0.58699 -0.000046
C  -4.423255 0.416932 -0.001921
C  -3.11294 1.236768 0.000966
C  -0.18124 -1.93453 -0.000479
C  -1.583207 -2.123691 -0.000138
C  1.821749 -0.256773 -0.000109
C  -0.108346 1.893831 0.000621
C  2.226038 1.139904 0.000166
C  1.238223 2.186579 0.000468
C  0.626395 -3.226431 0.00051
C  2.892694 -1.212094 -0.000316
C  3.608261 1.504434 0.000167
C  4.244058 -0.832608 -0.000308
C  4.617183 0.537633 -0.000058
H  -4.385604 -1.619388 -0.884261
H  -4.38374 -1.61446 0.891137
H  -5.022492 0.695834 0.883377
H  -5.016227 0.693085 -0.892337
H  -1.974509 -3.147795 -0.000045
H  -0.863798 2.684283 0.000939
H  1.578074 3.229091 0.000712
H  1.268626 -3.318863 0.895421
H  1.265984 -3.321931 -0.895978
H  -0.057816 -4.091684 0.002963
H  2.690974 -2.278055 -0.000782
H  3.863446 2.570824 0.00034
H  5.015904 -1.610579 -0.000509
H  5.672909 0.829029 -0.000019
