program: Gaussian 09
title: 000146987
version: EM64L-G09RevD.01
frameworkgroup: C1[X(C15H22N2)]
method: RPBEPBE
basis: SDD
operation: Freq
keyword: #pfreq=noraman
keyword: PBEPBE/SDD
title: #p freq=noraman PBEPBE/SDD
converged: YES YES NO NO
title: Mulliken charges:
elementType: N N C C C C C C C C C C C C C C C H H H H H H H H H H H H H H H H H H H H H H
charge: -0.405582 -0.077127 0.121983 0.388510 0.010276 -0.566774 0.233281 0.205997 -0.708099 -0.359331 -0.457336 0.406344 -0.833657 -0.846320 -0.842995 -0.620591 -0.616537 0.212989 0.223106 0.237558 0.197602 0.222130 0.266229 0.295737 0.238956 0.201739 0.239383 0.226111 0.244205 0.226794 0.219022 0.219387 0.231643 0.230935 0.183630 0.219742 0.219490 0.185796 0.225771
chargesum: 0.00000
title: Mulliken charges with hydrogens summed into heavy atoms:
elementType: N N C C C C C C C C C C C C C C C
charge: -0.109845 -0.077127 0.121983 0.388510 0.010276 -0.130679 0.233281 0.205997 -0.470541 0.060401 -0.191107 0.406344 -0.153579 -0.149209 -0.172943 0.013716 0.014520
polarizability: 2.29235273e+02 1.20229317e+01 1.99584261e+02 1.18201256e+01 -1.64279818e+00 1.13491941e+02
1716.lowfreq: -4.2365 -1.5653 -0.0003 0.0002 0.0004 6.3438 21.1606 31.0080 46.1247
frequency: 20.9668 30.9612 46.1104 73.5282 99.6033 106.0531 126.5399 143.2827 155.3868 184.9812 193.3483 209.1658 222.8864 244.4235 275.9697 301.0461 330.3701 332.9846 339.0351 350.0892 376.2128 424.4604 441.1265 455.2823 468.5742 477.6303 520.5516 563.6973 586.3169 615.4183 657.0208 692.4996 771.4208 780.6428 788.7902 796.9013 821.7751 836.6059 873.7681 934.8851 987.1741 999.5374 1009.1101 1013.2553 1019.3583 1032.7488 1034.6055 1051.2218 1056.7501 1072.4723 1078.8627 1089.8184 1102.7150 1126.5342 1156.1566 1195.3273 1219.9157 1237.7552 1246.1333 1260.5977 1289.6611 1296.8046 1314.4247 1338.2442 1364.7453 1383.0520 1392.4143 1396.4210 1403.3369 1409.4132 1416.2852 1438.4316 1439.2990 1451.6979 1459.6578 1459.7806 1461.9019 1470.4072 1470.5607 1474.8850 1479.6422 1483.7025 1486.1704 1489.8394 1491.1805 1499.2439 1567.0173 1589.4971 1637.1643 2835.9745 2841.6476 2859.8597 2962.5986 2967.3007 2975.3899 2980.4181 3014.9182 3021.4609 3026.7084 3030.7941 3033.7089 3051.2700 3052.4508 3069.4544 3074.7770 3076.3970 3084.5001 3098.0530 3121.0832 3217.4764 3619.5989
redmass: 2.6320 3.5608 3.6577 1.0287 1.9079 1.8927 2.9941 1.6308 1.9609 2.3434 1.2342 2.4371 1.1735 1.2878 2.8529 2.6424 2.8843 3.0698 2.7496 3.1788 2.9571 2.9533 2.5459 5.2177 3.4258 1.3683 2.9122 4.1060 2.8684 3.2165 3.8142 4.3356 2.2425 2.4282 1.7953 1.9273 3.1678 3.7319 1.5246 2.3752 2.6926 1.4301 2.5425 1.3860 1.7200 1.6872 1.4993 1.6434 2.5754 1.8967 2.1386 1.2991 1.5656 1.3206 1.6660 3.2979 1.8079 1.7883 2.5255 2.5359 1.3254 2.0684 1.6974 3.0069 1.3585 5.0944 1.3078 1.5911 1.4259 1.5150 1.1463 1.6617 1.4768 1.7038 1.0507 1.0629 1.0654 1.0571 1.0615 1.0596 1.0760 1.2694 1.0619 1.0600 1.0993 2.1993 6.3842 6.7530 6.6509 1.0581 1.0651 1.0619 1.0377 1.0401 1.0371 1.0623 1.0718 1.0850 1.0731 1.0968 1.0968 1.1002 1.0981 1.0974 1.1009 1.0976 1.1002 1.0947 1.0916 1.0982 1.0803
irintensity: 0.5357 0.3238 0.6329 0.0254 1.6288 0.3252 3.0139 1.9527 3.2295 1.4699 0.3314 1.1370 0.8693 0.6049 1.1984 0.2717 4.0463 1.5696 1.6967 2.0694 2.3352 2.1481 7.1662 3.0598 13.3195 87.1947 1.0189 0.1177 3.5235 0.6112 5.2087 15.9173 5.5303 3.2608 15.8844 5.6832 2.0246 14.2822 14.3656 1.0488 14.8988 10.8989 15.5415 11.0509 0.9587 24.8381 0.4403 1.8610 44.6276 16.3025 11.2960 6.8780 16.7360 3.9501 6.8126 12.5401 6.4824 1.1076 4.9238 6.3426 0.1958 7.5238 4.2108 41.3972 8.5507 12.6255 0.1358 7.9572 24.0455 0.8128 2.6573 8.1065 3.7955 27.8242 7.0943 3.8884 17.5050 15.4490 18.3977 13.0692 14.8068 8.7667 22.9503 6.0726 6.3152 14.6055 0.6377 6.2538 0.7815 70.6835 78.8174 195.7411 62.5268 48.6207 43.1344 28.4468 48.9231 33.1327 37.6148 50.1070 0.4804 32.2928 19.3928 34.1203 35.8455 28.6132 50.6805 20.4145 19.7067 1.9903 47.2291
temp: 298.150 k
press: 1.00000 atm
elementType: 7 7 6 6 6 6 6 6 6 6 6 6 6 6 6 6 6 1 1 1 1 1 1 1 1 1 1 1 1 1 1 1 1 1 1 1 1 1 1
symmnumber: 1
zpe: 882431.8 jmol-1
zpe.correction: 0.336101 hartree
zpe.thermalcorrener: 0.354752 hartree
zpe.thermalcorrenthalpy: 0.355697 hartree
zpe.thermalcorrgfe: 0.288588 hartree
zpe.sumelectzpe: -693.008233 hartree
zpe.sumelectthermal: -692.989581 hartree
zpe.sumelectthermalent: -692.988637 hartree
zpe.sumelectthermalfe: -693.055746 hartree
dipole: 1.4043 -0.8965 0.7962
dipole: 1.8465
quadrupole: -96.3010 -90.7824 -107.1902
quadrupole: -6.7365 0.0214 -1.8471
quadrupole: 1.7902 7.3088 -9.0990 -6.7365 0.0214 -1.8471
hfenergy: -693.3443336 hartree
pointgroup: C01[X(C15H22N2)]
dipole: -0.5351045 0.3801613 0.3112901 debye
polarizability: 229.9291877|10.5864648|198.71566|-12.9800384|0.4908863|113.6666264 unknown
InChI: InChI=1S/C15H22N2/c1-10-8-14-13(6-7-17(4)5)9-16-15(14)12(3)11(10)2/h8-9,16H,6-7H2,1-5H3
charge 0 multiplicity 1
39 atoms
N  -0.892021 2.484617 -0.093137
N  4.388572 -0.376414 0.147325
C  -0.297069 0.294359 -0.311714
C  0.886005 1.111299 -0.537417
C  -1.396657 1.176177 -0.035772
C  2.28061 0.61966 -0.839939
C  -2.712375 0.716404 0.229064
C  -2.921906 -0.688522 0.209387
C  -0.539019 -1.102872 -0.326392
C  2.987277 0.033089 0.411816
C  0.478765 2.43779 -0.396171
C  -1.833709 -1.594318 -0.07133
C  -3.833296 1.70598 0.517208
C  -4.300621 -1.272708 0.481283
C  -2.082739 -3.094213 -0.092126
C  4.492105 -1.569099 -0.717538
C  5.158919 -0.547268 1.396658
H  2.235007 -0.148929 -1.636424
H  2.911319 1.441824 -1.225459
H  0.276166 -1.804745 -0.538472
H  2.377296 -0.814277 0.820101
H  3.004981 0.816629 1.192333
H  1.062722 3.351602 -0.494495
H  -1.430912 3.335004 0.046571
H  -4.281639 1.538278 1.514439
H  -3.479722 2.752046 0.497411
H  -4.649457 1.628052 -0.225346
H  -4.28259 -1.962279 1.347855
H  -5.053118 -0.496792 0.691564
H  -4.665427 -1.864195 -0.381371
H  -2.459336 -3.465481 0.88115
H  -2.836881 -3.378377 -0.852171
H  -1.153926 -3.643854 -0.322069
H  4.015862 -1.379958 -1.694252
H  4.014153 -2.478791 -0.268151
H  5.556781 -1.799063 -0.902797
H  6.215686 -0.763402 1.155235
H  4.778831 -1.377084 2.047157
H  5.126858 0.387529 1.984287
