program: Gaussian 09
title: 000147085
version: EM64L-G09RevD.01
frameworkgroup: C1[X(C9H12N5O8P)]
method: RPBEPBE
basis: SDD
operation: Freq
keyword: #p
keyword: freq=noraman
keyword: PBEPBE/SDD
title: #p freq=noraman PBEPBE/SDD
converged: YES YES NO NO
title: Mulliken charges:
elementType: P O O O O O O O O N N N N N C C C C C C C C C H H H H H H H H H H H H
charge: 1.388077 -0.264397 -0.431532 -0.537600 -0.231549 -0.685329 -0.705230 -0.562416 -0.368022 -0.207874 0.044179 -0.081652 0.019271 -0.121435 -0.117187 -0.085298 -0.506904 -0.020356 -0.318531 -0.134796 0.065021 0.041137 0.061063 0.220561 0.268280 0.242042 0.311933 0.298254 0.236024 0.276615 0.343770 0.344842 0.389534 0.414850 0.414656
chargesum: 0.00000
title: Mulliken charges with hydrogens summed into heavy atoms:
elementType: P O O O O O O O O N N N N N C C C C C C C C C
charge: 1.388077 -0.264397 -0.087762 -0.537600 -0.231549 -0.270479 -0.290574 -0.562416 0.021512 -0.207874 0.044179 -0.081652 0.019271 -0.121435 0.103374 0.182982 0.047071 0.277898 0.194108 0.210046 0.065021 0.041137 0.061063
polarizability: 2.40019892e+02 2.59364986e+01 2.30516867e+02 -9.17480176e+00 -7.89799309e-01 1.10717119e+02
1716.lowfreq: -11.9931 -10.7235 -0.0014 -0.0013 0.0013 2.3698 9.8847 24.8208 41.5102
frequency: -9.1014 24.3478 41.5028 50.8441 60.1382 79.7308 91.2356 105.2671 114.5622 126.0022 139.2746 149.6447 157.1891 195.1305 216.4687 222.4337 256.7090 262.1012 270.9072 277.6921 300.8784 314.5255 326.3496 353.8053 356.0347 382.2088 386.8409 401.5731 407.8903 429.2730 444.3925 450.7574 513.0817 528.3330 537.6008 549.2833 574.8762 631.5320 647.4766 653.6103 699.4126 705.9136 713.3280 726.1514 740.3852 751.5675 760.5739 811.5882 832.0601 873.3047 915.6017 936.8333 952.8370 958.2289 983.9663 992.2242 1010.5886 1023.8006 1045.8423 1062.9001 1072.5359 1075.6601 1081.8934 1114.3054 1142.2946 1160.8913 1179.2157 1219.9289 1224.7262 1237.0131 1250.0023 1254.7751 1279.5027 1288.1621 1300.7586 1328.7903 1334.8293 1363.3756 1373.6081 1380.5430 1429.8832 1454.4840 1469.7557 1518.7395 1600.1417 1636.9241 2075.3037 2976.1581 3000.2015 3047.5848 3058.9313 3077.5695 3080.3061 3118.4916 3135.8902 3388.6295 3473.9878 3560.2712 3623.0905
redmass: 8.7703 8.8139 12.1463 8.3718 6.0828 7.6897 8.4438 4.2664 3.7976 8.3646 3.8076 1.9721 6.4760 7.5901 4.6126 7.8790 6.4429 5.6436 5.5076 1.2432 5.0207 5.3252 4.8090 5.9586 8.7168 11.3634 9.1059 7.7651 9.6593 4.0141 10.2047 3.2163 3.0002 1.3930 3.4425 1.1201 6.1476 9.6938 5.7773 5.6963 9.7937 6.7367 7.3236 8.6198 10.2625 11.4158 5.2136 3.8312 3.9643 3.2028 3.2546 2.5850 5.8354 1.4040 5.7113 2.1954 1.2672 3.0339 3.7565 2.8097 3.7091 4.5612 2.5901 1.5189 6.3859 1.2145 1.3111 1.3370 1.8327 1.3537 2.1433 1.3035 1.3652 1.4624 1.4253 2.2706 1.3107 1.3617 2.5487 1.3412 4.5519 1.0947 1.0861 5.9698 8.5771 9.3476 13.8530 1.0844 1.0592 1.0664 1.0893 1.0907 1.1011 1.0959 1.1002 1.0676 1.0647 1.0664 1.0666
irintensity: 3.1213 0.7735 1.4028 3.0160 2.3342 5.2332 1.2377 1.7980 39.6579 2.8156 6.4342 60.1475 28.7690 0.9169 6.8161 3.0553 12.7949 8.2716 29.7861 135.0433 4.4131 4.6042 29.4117 28.6283 67.5736 1.4731 17.7552 11.2635 14.1433 4.4532 0.4948 15.1202 1.0336 338.9702 78.4239 127.5417 3.6787 25.9956 8.0442 30.9383 3.4063 214.2886 47.1974 3.9588 26.6388 174.0492 35.4958 30.9897 27.8135 16.4814 9.6924 61.7839 177.3625 19.5208 113.7847 39.1353 111.1953 22.3163 88.4043 13.0097 120.8894 81.0353 4.6517 146.2562 37.3623 67.2595 4.6578 18.4772 15.3377 26.2108 229.2905 50.0578 20.4504 39.5537 70.5539 6.7268 13.2670 4.1746 156.2631 1.9164 139.6722 10.9182 15.6507 128.5863 37.3639 698.2662 526.3149 38.2874 32.4752 12.2198 7.0373 9.7845 19.1633 33.6340 2.0011 415.0937 84.0703 9.0725 97.4261
temp: 298.150 k
press: 1.00000 atm
elementType: 15 8 8 8 8 8 8 8 8 7 7 7 7 7 6 6 6 6 6 6 6 6 6 1 1 1 1 1 1 1 1 1 1 1 1
symmnumber: 1
zpe: 621566.3 jmol-1
zpe.correction: 0.236742 hartree
zpe.thermalcorrener: 0.259071 hartree
zpe.thermalcorrenthalpy: 0.260015 hartree
zpe.thermalcorrgfe: 0.184937 hartree
zpe.sumelectzpe: -1565.103333 hartree
zpe.sumelectthermal: -1565.081004 hartree
zpe.sumelectthermalent: -1565.080060 hartree
zpe.sumelectthermalfe: -1565.155138 hartree
dipole: -6.5258 0.4570 -3.6645
dipole: 7.4982
quadrupole: -180.3069 -125.9746 -144.7251
quadrupole: -16.9631 17.4859 -1.4341
quadrupole: -29.9714 24.3610 5.6105 -16.9631 17.4859 -1.4341
hfenergy: -1565.3400748 hartree
pointgroup: C01 [X(C9H12N5O8P1)]
dipole: -2.6445874 0.1886536 1.29353 debye
polarizability: 231.4556165|-25.8937621|237.5839998|16.0818839|-5.1348179|112.2142617 unknown
InChI: InChI=1S/C9H12N5O8P/c10-13-12-4-2-14(9(17)11-8(4)16)7-1-5(15)6(22-7)3-21-23(18,19)20/h2,5-7,15-16,18-19H,1,3H2
charge 0 multiplicity 1
35 atoms
P  -3.828062 1.146382 -0.210674
O  -0.415029 -1.677392 -1.097809
O  -0.875057 -4.547395 -0.076791
O  -2.486539 0.085409 -0.395129
O  3.426923 -1.989441 0.423871
O  -3.373119 2.319015 0.957966
O  -4.837858 0.167561 0.772736
O  -4.374996 1.694311 -1.585704
O  3.782208 2.668682 0.652269
N  1.552628 -0.6988 -0.115881
N  3.649465 0.359091 0.517694
N  1.15024 3.015823 0.020688
N  -0.067231 3.286656 -0.139388
N  -1.171792 3.70787 -0.270051
C  -0.968684 -3.263195 0.62264
C  -1.559576 -2.145877 -0.278131
C  0.481599 -2.797528 0.86018
C  0.835767 -1.990745 -0.418767
C  -2.17671 -1.012129 0.554432
C  0.929452 0.514637 -0.24065
C  2.95378 -0.829131 0.297236
C  1.641975 1.673265 0.051517
C  3.040241 1.530152 0.411273
H  -1.538183 -3.372274 1.569182
H  -2.306029 -2.515627 -1.00211
H  0.556765 -2.162479 1.759081
H  1.151051 -3.659054 0.987943
H  1.48915 -2.556714 -1.101086
H  -1.474642 -0.624139 1.316271
H  -3.102429 -1.355904 1.049602
H  -1.777245 -4.860377 -0.341296
H  -0.109123 0.499936 -0.594647
H  3.209341 3.476454 0.534323
H  -2.822611 3.076881 0.603537
H  -5.647873 0.607173 1.131272
