program: Gaussian 09
title: 000146931
version: EM64L-G09RevD.01
frameworkgroup: C1[X(C12H10O3)]
method: RPBEPBE
basis: SDD
operation: Freq
keyword: #pfreq=noraman
keyword: PBEPBE/SDD
title: #p freq=noraman PBEPBE/SDD
converged: YES YES YES YES
title: Mulliken charges:
elementType: O O O C C C C C C C C C C C C H H H H H H H H H H
charge: -0.252174 -0.245902 -0.205447 0.213396 -0.547138 0.263653 -0.309128 0.248468 -0.554702 0.216874 -0.519726 0.383057 -0.483245 -0.807692 0.123072 0.247674 0.243791 0.234980 0.231435 0.255949 0.288763 0.252532 0.239673 0.239808 0.242031
chargesum: 0.00000
title: Mulliken charges with hydrogens summed into heavy atoms:
elementType: O O O C C C C C C C C C C C C
charge: -0.252174 -0.245902 -0.205447 0.213396 -0.055673 0.263653 0.157287 0.248468 -0.298753 0.216874 -0.230963 0.383057 -0.230713 -0.086180 0.123072
polarizability: 2.40798280e+02 7.98741521e+00 1.40422988e+02 -1.98651256e-01 -1.50558176e-01 6.66829769e+01
1716.lowfreq: -6.9779 -0.0008 0.0005 0.0007 4.5710 5.6853 71.7457 76.3834 120.3348
frequency: 71.7441 76.3808 120.3340 165.7171 178.2894 200.4943 207.5674 266.0409 298.0732 333.8531 345.0840 385.3668 432.9947 475.1275 526.0184 545.7044 545.7588 640.1353 645.4086 668.3948 680.6718 712.1609 742.3870 761.7086 772.3932 821.1192 843.3503 862.4962 864.9117 890.2924 908.6398 973.4188 992.3660 1029.9994 1044.9076 1052.0610 1103.0786 1105.2769 1159.6959 1176.0952 1195.9231 1219.5223 1240.1477 1259.5186 1269.0375 1337.4015 1369.8336 1386.5825 1399.9850 1457.2082 1462.8645 1468.2070 1471.0056 1481.3623 1491.3865 1564.9456 1606.3803 1633.2466 1688.0038 2980.7218 2998.7951 3026.3739 3057.0771 3060.3006 3102.6791 3112.8418 3151.1178 3170.6633 3195.4681
redmass: 4.3152 2.5084 3.8939 2.1868 2.8678 4.6287 1.5742 5.8373 4.3073 4.9831 5.4461 7.9463 3.0334 5.5978 5.8442 5.6832 4.2003 5.4783 5.5441 3.5858 5.3876 5.1619 3.8413 7.4984 6.0637 1.6000 4.4326 1.3905 1.5192 1.4721 3.2221 2.9722 2.0704 3.3507 1.5748 1.6564 4.4932 2.7079 1.2057 2.4263 1.2492 2.3529 1.2540 1.4289 2.2613 1.4597 3.0505 4.3316 1.3880 5.2339 1.1878 1.0460 1.1178 1.3247 2.3415 8.0401 7.6698 7.9689 10.4642 1.0382 1.0621 1.0652 1.0969 1.0985 1.0983 1.1069 1.0918 1.0920 1.0937
irintensity: 0.7500 1.2730 1.1284 1.3402 2.3022 0.0299 1.3568 7.4150 0.2276 1.0069 6.7746 4.9393 6.7847 4.0334 3.7950 4.0651 1.4599 3.1084 6.2410 4.5282 8.0023 15.4316 1.3625 14.4732 5.7474 10.7842 21.2660 36.4784 9.8456 41.1414 61.7360 4.9623 7.5405 123.3419 7.7331 4.9941 54.6463 44.4850 5.2007 22.6511 15.2047 9.9384 3.7607 0.0302 90.1998 10.9152 134.5686 11.8779 40.2709 75.5665 11.0919 16.7396 8.6799 1.3024 53.2654 98.0785 13.0572 316.1190 542.1609 13.7848 28.4863 69.5578 13.7238 20.8651 20.8363 27.7682 6.3944 1.8416 0.6512
temp: 298.150 k
press: 1.00000 atm
elementType: 8 8 8 6 6 6 6 6 6 6 6 6 6 6 6 1 1 1 1 1 1 1 1 1 1
symmnumber: 1
zpe: 499345.9 jmol-1
zpe.correction: 0.190191 hartree
zpe.thermalcorrener: 0.202367 hartree
zpe.thermalcorrenthalpy: 0.203311 hartree
zpe.thermalcorrgfe: 0.151864 hartree
zpe.sumelectzpe: -687.893144 hartree
zpe.sumelectthermal: -687.880968 hartree
zpe.sumelectthermalent: -687.880024 hartree
zpe.sumelectthermalfe: -687.931471 hartree
dipole: 5.6308 6.4104 0.1690
dipole: 8.5339
quadrupole: -88.0194 -86.7811 -87.3198
quadrupole: -9.1310 0.6674 -0.1617
quadrupole: -0.6460 0.5923 0.0537 -9.1310 0.6674 -0.1617
hfenergy: -688.0833352 hartree
pointgroup: C01 [X(C12H10O3)]
dipole: 2.2224114 -2.5158459 -0.0641304 debye
dipolederiv: -1.7186826 -0.1557164 0.0652835 -0.3849017 -0.4134553 -0.011279 -0.0363582 -0.0087798 -0.2696095 -1.367886 0.2210196 0.0010129 -0.0770791 -0.3653629 -0.0002472 -0.0034835 -0.000255 -0.199445 -1.3171742 0.4079993 0.0000669 0.778201 -0.7758817 -0.0001193 -0.0028928 0.0013254 -0.3435611 -0.1553288 -0.0498501 0.0178748 -0.8477279 -0.2029667 0.0124183 0.0781008 -0.0044807 -0.0839222 -0.1373504 -0.0926797 0.0126342 0.0652055 -0.0191501 0.0092684 -0.0217967 0.0208966 0.1622808 1.3435356 0.2312035 -0.0319551 0.9121992 0.3060024 -0.0304144 0.0170508 -0.0115772 0.0803579 0.7986325 -0.0324732 -0.0423717 -0.4001583 0.2419632 0.045234 -0.0677872 0.0109325 0.3551004 -0.7701925 -0.0731084 0.0054442 -0.2584149 -0.4210561 0.0052551 -0.0099516 0.0059773 -0.036761 0.5317725 0.0089945 -0.0075386 0.0316892 0.1089879 -0.0048868 -0.0161427 -0.006333 -0.1352262 0.8293424 -0.1214993 -0.0034464 -0.0049516 0.4042704 -0.0026856 -0.0006146 -0.0010331 0.1247922 -0.6429626 -0.0724705 0.008158 0.0420947 0.0059077 -0.0018283 0.0171977 0.001764 -0.1967413 1.1118192 -0.0163789 -0.0033368 0.1723071 0.5454651 -0.0019277 0.0029802 -0.0034925 0.0169308 -0.5347673 0.1593551 0.0016081 0.7301226 -0.5745123 -0.0004726 -0.0006235 0.0005349 -0.1997474 0.0394738 0.0486996 0.0001361 -0.0588722 -0.2268152 0.0005881 -0.0008094 0.001319 0.0507144 1.9412295 -0.4260569 0.0009285 -0.9038416 1.1393652 0.0008137 0.0032883 -0.0020616 0.2760437 -0.0126574 0.0341199 -0.031011 0.0408663 0.0325174 0.0693401 -0.0946321 0.1031728 -0.0674989 0.02721 0.0360142 0.0218398 0.0721048 -0.0234098 -0.0811432 0.080682 -0.1078371 0.0098568 -0.1127272 -0.0235399 -0.0699608 0.0153098 0.0706703 -0.0216874 -0.1333467 -0.0278322 0.0121157 -0.0231111 -0.0057247 0.054348 0.092606 0.0545647 0.0099136 0.1784835 0.022436 -0.1180321 0.1086802 0.0004864 0.0008575 0.0165075 -0.073179 0.0024647 0.0062461 0.0022462 0.1399121 0.0963618 0.0050764 -0.0004008 -0.0080107 0.0209174 0.0012631 0.0044629 0.0029683 0.1931061 -0.0152403 -0.0615977 -0.0000791 -0.0567777 0.0351203 0.0000659 0.000071 0.00044 0.1684317 0.050895 0.0508217 -0.103166 0.0213597 0.032017 0.0374266 -0.0793868 0.0733225 -0.0260225 0.0495547 0.0512392 0.1032872 0.0212989 0.0319758 -0.0373289 0.0798302 -0.0733801 -0.0249777 -0.1204268 -0.1239339 -0.0002133 -0.0111366 0.0660444 -0.0000312 -0.0005677 -0.000273 0.1119022 unknown
polarizability: 240.8392725|-7.6910635|140.3698193|-1.035634|-0.6456661|66.6951534 unknown
InChI: InChI=1S/C12H10O3/c1-7-4-12(13)15-11-6-10-8(2-3-14-10)5-9(7)11/h4-6H,2-3H2,1H3
charge 0 multiplicity 1
25 atoms
O  3.183025 1.343417 -0.005995
O  -1.659551 1.514074 -0.000713
O  -3.965151 1.6334 -0.004288
C  1.940416 -0.654178 0.003998
C  3.393331 -1.109094 0.059487
C  1.910266 0.769293 -0.005434
C  4.171653 0.218401 -0.187765
C  -0.507237 -0.671307 0.003538
C  0.742763 -1.367973 0.008479
C  -0.482402 0.762418 0.002109
C  0.719239 1.505142 -0.002739
C  -1.803201 -1.338598 0.002107
C  -2.960495 -0.578957 -0.000012
C  -1.879598 -2.850508 0.003454
C  -2.975341 0.876358 -0.0018
H  3.634912 -1.539199 1.049379
H  3.637671 -1.867727 -0.704026
H  4.988381 0.400587 0.526813
H  4.551706 0.295166 -1.221576
H  0.74913 -2.462388 0.019505
H  0.697523 2.596332 -0.009411
H  -3.946552 -1.051188 -0.000625
H  -1.381603 -3.275148 0.895482
H  -1.377141 -3.277001 -0.885132
H  -2.926342 -3.194122 0.001366
