program: Gaussian 09
title: 000146932
version: EM64L-G09RevD.01
frameworkgroup: C1[X(C17H12O)]
method: RPBEPBE
basis: SDD
operation: Freq
keyword: #pfreq=noraman
keyword: PBEPBE/SDD
title: #p freq=noraman PBEPBE/SDD
converged: YES YES NO YES
title: Mulliken charges:
elementType: O C C C C C C C C C C C C C C C C C H H H H H H H H H H H H
charge: -0.440129 0.010848 0.014600 0.476440 0.477872 0.475616 0.475920 -0.609301 -0.682770 0.394901 -0.489012 -0.488682 -0.481335 -0.478985 -0.463473 -0.463770 -0.241841 -0.447633 0.279568 0.245807 0.241105 0.237745 0.236881 0.236977 0.241537 0.241719 0.227024 0.198765 0.234891 0.338716
chargesum: 0.00000
title: Mulliken charges with hydrogens summed into heavy atoms:
elementType: O C C C C C C C C C C C C C C C C C
charge: -0.101413 0.010848 0.014600 0.476440 0.477872 0.475616 0.475920 -0.329733 -0.436963 0.394901 -0.247908 -0.250937 -0.244454 -0.242009 -0.221937 -0.222051 -0.014816 -0.013976
polarizability: 3.21164770e+02 -5.03323984e+00 2.07567601e+02 7.00532752e+00 5.40468251e-01 7.89126283e+01
1716.lowfreq: -6.7717 -3.8953 -0.0007 -0.0005 0.0004 11.4941 38.6391 70.8807 137.3427
frequency: 38.5953 70.8755 137.3420 153.7540 188.7442 218.8619 247.2343 270.3871 325.0223 363.5968 378.8744 398.5195 441.3715 465.3994 493.1202 500.6038 507.3673 526.7689 539.8447 552.5877 570.7555 596.2285 648.2367 695.4990 733.0597 749.1833 759.4174 769.8388 809.2104 823.8588 830.3479 865.6986 894.8266 906.9423 923.2893 933.3142 965.4047 976.8602 981.8503 986.1630 989.3162 991.1544 1002.1777 1079.4709 1120.4748 1139.9862 1159.0643 1173.1610 1173.8943 1190.7612 1218.5664 1244.3327 1255.3263 1291.5734 1302.0823 1338.3023 1360.1889 1380.3861 1386.9158 1421.5967 1433.1674 1434.5719 1443.6273 1464.1392 1467.4314 1485.2102 1497.4972 1567.1565 1597.2543 1606.4900 1612.5826 1640.0127 2956.8531 3047.9367 3111.3196 3119.1936 3120.5391 3122.8719 3132.0170 3138.2658 3144.1688 3145.8164 3157.0291 3555.0648
redmass: 4.3461 3.7393 5.2977 4.2023 3.2708 3.8976 3.4699 3.7462 3.9951 1.8536 2.6144 3.4125 5.1380 6.7458 5.0056 3.7697 3.9682 4.0502 2.9901 6.8095 4.6543 4.0831 4.4377 3.7065 2.5009 5.6849 4.3179 1.2995 4.9421 1.4172 1.6947 3.0460 1.7937 1.4549 1.5042 4.0625 2.3192 1.4749 3.1906 1.3945 7.0792 1.4564 3.0481 1.9563 2.4812 1.5262 1.1246 1.2619 1.2707 1.2473 1.7358 1.4843 1.8273 1.9188 1.7437 2.9028 1.3534 2.1315 3.1544 2.2139 4.4361 6.5067 3.1923 4.1919 1.1274 5.2528 4.0858 4.5604 8.1502 6.4916 6.0840 7.6143 1.0674 1.0949 1.0912 1.0861 1.0862 1.0860 1.0918 1.0915 1.0981 1.0979 1.0989 1.0661
irintensity: 2.8110 1.7774 0.3398 0.5637 5.1054 12.1174 1.0739 8.9209 24.0964 151.1204 52.1411 0.7577 14.2379 3.7333 3.6701 2.1955 1.9520 1.1787 0.0244 2.5850 2.6406 1.6942 4.6411 0.0649 50.4559 0.1676 3.5743 5.5829 3.8040 1.1559 4.4922 30.1005 110.0041 28.5425 3.7068 27.9352 8.2750 4.1252 36.0146 0.2073 1.3944 3.4162 12.6375 2.7225 0.0990 7.5201 16.7979 16.3707 7.0726 18.1363 2.5252 0.1738 4.2494 3.7315 5.8230 0.6747 52.8005 7.5807 4.3590 5.2614 2.1507 0.1305 7.4931 1.4933 6.0088 0.3220 0.3332 0.0239 0.0924 2.6560 21.4956 1.5383 65.3892 17.9625 12.1835 2.8128 1.2869 0.0918 13.6142 1.0982 45.4454 21.2407 41.9629 8.8536
temp: 298.150 k
press: 1.00000 atm
elementType: 8 6 6 6 6 6 6 6 6 6 6 6 6 6 6 6 6 6 1 1 1 1 1 1 1 1 1 1 1 1
symmnumber: 1
zpe: 618815.1 jmol-1
zpe.correction: 0.235694 hartree
zpe.thermalcorrener: 0.248728 hartree
zpe.thermalcorrenthalpy: 0.249672 hartree
zpe.thermalcorrgfe: 0.196162 hartree
zpe.sumelectzpe: -729.064364 hartree
zpe.sumelectthermal: -729.051330 hartree
zpe.sumelectthermalent: -729.050386 hartree
zpe.sumelectthermalfe: -729.103896 hartree
dipole: 1.5329 1.0624 0.6294
dipole: 1.9684
quadrupole: -103.0877 -90.4130 -107.3907
quadrupole: -6.4183 -1.7567 -0.2104
quadrupole: -2.7906 9.8841 -7.0935 -6.4183 -1.7567 -0.2104
hfenergy: -729.300058 hartree
pointgroup: C01 [X(C17H12O1)]
dipole: 0.5822372 0.4626023 0.216196 debye
polarizability: 321.2439674|0.6149312|206.6446358|9.1110262|-9.4912851|79.7563959 unknown
InChI: InChI=1S/C17H12O/c18-10-11-8-14-6-4-12-2-1-3-13-5-7-15(9-11)17(14)16(12)13/h1-9,18H,10H2
charge 0 multiplicity 1
30 atoms
O  -5.133485 -0.848072 0.547701
C  -0.104775 0.062851 -0.070627
C  1.329398 0.02986 -0.001304
C  -0.863154 -1.164607 -0.028172
C  -0.796845 1.32344 -0.181138
C  2.083837 1.259291 -0.041631
C  2.018648 -1.233112 0.108956
C  -2.279139 -1.109703 -0.099004
C  -2.216198 1.329976 -0.243551
C  -2.958509 0.12719 -0.211215
C  -0.145964 -2.418575 0.083748
C  -0.016443 2.542885 -0.216947
C  1.365215 2.511565 -0.150982
C  1.235323 -2.45091 0.148744
C  3.502488 1.203521 0.027271
C  3.438081 -1.24293 0.175269
C  4.169053 -0.035823 0.134276
C  -4.478338 0.1573 -0.305315
H  -2.86397 -2.036279 -0.069482
H  -2.741292 2.291182 -0.319251
H  -0.725781 -3.348521 0.115093
H  -0.546287 3.499286 -0.299935
H  1.943445 3.442712 -0.181174
H  1.764644 -3.40745 0.232755
H  4.077477 2.136465 -0.00382
H  3.963969 -2.20123 0.259247
H  5.262957 -0.061469 0.186028
H  -4.852291 1.178186 -0.078019
H  -4.818275 -0.108802 -1.322087
H  -4.81609 -0.728126 1.478967
