program: Gaussian 09
title: 000147199
version: EM64L-G09RevD.01
frameworkgroup: C1[X(C24H29NO6)]
method: RPBEPBE
basis: SDD
operation: Freq
keyword: #p
keyword: freq=noraman
keyword: PBEPBE/SDD
title: #p freq=noraman PBEPBE/SDD
converged: YES YES NO NO
title: Mulliken charges:
elementType: O O O O O O N C C C C C C C C C C C C C C C C C C C C C C C C H H H H H H H H H H H H H H H H H H H H H H H H H H H H H
charge: -0.296267 -0.274544 -0.270847 -0.277123 -0.279941 -0.265311 -0.146102 0.348400 -0.544686 -0.306838 -0.371034 -0.369780 -0.467683 -0.460102 -0.790733 0.369943 0.170123 0.221570 -0.518601 -0.536673 0.258926 0.179357 0.166271 0.200092 -0.557759 -0.552371 0.339031 -0.208574 -0.536004 -0.531576 -0.536000 0.236427 0.275384 0.292340 0.234278 0.209362 0.225563 0.212298 0.222215 0.220448 0.218803 0.216222 0.225089 0.246452 0.252332 0.264308 0.265003 0.252395 0.262323 0.233200 0.221026 0.224684 0.211699 0.249729 0.222195 0.224091 0.242460 0.245881 0.218309 0.220322
chargesum: 0.00000
title: Mulliken charges with hydrogens summed into heavy atoms:
elementType: O O O O O O N C C C C C C C C C C C C C C C C C C C C C C C C
charge: -0.296267 -0.274544 -0.270847 -0.277123 -0.279941 -0.265311 -0.146102 0.348400 -0.032875 -0.014497 0.072606 0.068081 -0.025019 -0.025077 -0.066861 0.369943 0.170123 0.221570 -0.254293 -0.271670 0.258926 0.179357 0.166271 0.200092 -0.305364 -0.290048 0.339031 0.245652 0.150107 0.157171 0.148512
polarizability: 3.32505294e+02 -1.31793807e+00 2.96653670e+02 -3.25414204e+00 -1.13572818e+01 2.55865672e+02
1716.lowfreq: -6.2396 -5.9949 -0.0009 -0.0004 0.0006 3.2232 21.4741 25.8114 29.7303
frequency: 21.4592 25.6205 29.4535 38.3769 50.3401 56.0724 66.9161 82.1100 95.3259 108.0905 112.8171 120.8865 123.6435 149.6672 157.1447 165.0087 184.3353 187.2689 193.0383 199.4993 219.4061 237.0302 243.5147 244.6478 257.2108 262.6687 267.3062 280.1056 295.3232 309.4903 333.7199 344.0875 353.7067 360.6122 366.2635 394.1447 424.4843 434.2051 440.4636 496.5275 498.0021 515.8249 529.7376 556.1251 557.2716 573.0436 588.6494 594.1409 622.5618 625.1709 643.0360 653.8451 673.1732 694.3277 706.4599 728.7109 748.5782 759.0221 762.8922 790.8710 813.7028 829.4332 833.7013 842.4636 848.7195 849.8086 869.1936 874.1233 882.3470 904.4608 908.6533 916.7547 928.2059 935.2651 971.4517 983.5276 991.1970 993.4672 1024.6703 1033.9440 1047.2498 1066.9430 1077.3557 1080.4824 1090.1190 1110.5223 1111.6786 1112.5418 1114.5889 1123.0426 1131.4390 1135.9259 1141.3617 1152.8687 1155.1723 1158.4116 1159.4252 1164.6211 1166.0548 1187.9629 1206.2811 1218.7712 1219.8004 1226.9533 1241.3040 1259.3958 1270.4130 1283.8383 1302.0906 1303.3975 1311.0766 1313.3957 1318.1267 1335.7497 1344.7669 1357.5128 1366.2161 1390.6913 1396.2632 1404.4221 1410.5494 1411.3491 1430.8987 1444.6609 1447.3044 1458.5760 1463.5276 1464.5936 1464.8979 1465.5722 1467.2953 1468.6879 1470.3702 1473.5116 1474.1975 1476.2875 1482.6579 1484.3230 1491.2734 1493.5328 1498.3087 1594.7963 1611.2853 1620.8719 1626.3678 2930.1637 2955.6466 2957.0414 2962.0485 2966.5100 2972.8816 3000.3792 3002.3557 3004.7728 3006.5122 3017.6162 3022.5217 3036.6385 3042.8740 3046.3550 3051.2679 3070.3189 3085.5511 3092.7057 3098.9908 3109.5101 3110.3984 3122.6495 3122.8911 3123.7667 3157.8215 3183.2308 3186.4612 3187.7550
redmass: 4.4238 4.4829 4.4188 4.3019 3.7659 3.3218 3.1192 3.2891 3.5531 3.5842 3.0817 3.1427 5.3440 3.8162 3.4457 3.1841 2.2061 3.7099 2.0823 1.7877 3.1061 1.3454 2.1674 1.7578 4.9041 1.7142 2.0822 1.7653 3.6966 3.1087 3.1285 3.8850 4.5196 3.8127 6.1566 4.2720 3.9511 4.2505 4.1234 6.4740 3.6732 4.8316 4.9536 5.1568 5.6348 2.0872 5.6113 3.8026 3.4644 3.4705 6.3947 5.4466 7.6630 4.4718 4.1663 3.4139 4.4837 3.1528 3.4430 1.7332 4.1448 3.7717 2.4826 3.3619 1.7923 1.7512 4.1891 1.8092 1.6434 3.9580 3.8622 2.3946 1.9215 1.7089 5.6776 1.7418 5.7197 4.0742 2.0894 3.5788 1.8605 2.4397 1.5264 2.9404 3.2719 1.2592 1.2589 1.2599 1.8649 2.3529 2.3498 1.2946 1.6539 1.5168 2.2889 1.4409 1.5519 1.6408 1.5879 1.8882 2.0164 1.4721 1.6288 1.2809 1.3234 4.1752 2.0997 2.1903 5.1892 1.3699 1.8719 1.2944 1.4718 1.5740 1.4114 1.2906 1.6314 1.2748 5.3547 3.3897 2.2186 5.6117 1.1587 1.2464 1.4733 1.1182 1.9380 1.0926 1.0966 1.1186 1.2296 1.0665 1.0931 1.0966 1.0525 1.0664 1.3792 1.0799 1.2007 1.7485 1.0917 7.2629 7.5463 10.1938 8.2865 1.0678 1.0331 1.0334 1.0325 1.0591 1.0649 1.0447 1.0737 1.0637 1.0699 1.0640 1.0942 1.0927 1.1038 1.1033 1.1040 1.1016 1.1058 1.0990 1.0984 1.0991 1.1049 1.0999 1.0991 1.0993 1.0921 1.0898 1.0928 1.0910
irintensity: 0.0340 0.4601 0.7224 0.7187 0.5574 2.0197 3.0943 8.2868 3.6184 0.6926 2.3628 11.8366 0.1241 0.4619 7.7845 1.2341 1.0759 4.3372 4.0994 2.1407 1.3730 0.1096 0.4814 1.3587 0.8258 0.8739 2.2206 0.2478 4.6017 4.9604 4.6251 1.1147 0.9163 3.7575 1.0015 3.2894 10.4062 19.6251 24.7248 8.1541 27.4995 5.7348 9.5200 21.2955 8.0580 2.2717 51.3646 1.1418 9.8669 75.7201 0.6337 11.2209 1.7335 2.7005 3.0605 23.6143 16.2887 19.2857 4.4523 4.0832 145.6423 29.9441 41.4368 14.6397 3.0686 21.6382 8.5139 2.8045 21.2405 39.8778 13.7780 3.1773 13.9125 0.2043 153.6273 8.7253 34.4034 43.9685 40.5337 48.6831 81.4679 82.4254 8.7071 113.1148 182.8387 0.2699 0.0681 0.3213 36.8216 146.5847 84.9102 3.3555 97.6223 18.2027 27.5088 43.3349 3.4661 43.1555 2.5832 49.2495 16.0835 20.8409 34.5987 15.7299 6.0808 65.6586 22.7451 75.4217 42.5844 6.4573 194.2423 17.2661 6.0764 5.4067 1.2636 1.1143 58.6559 40.3131 109.4564 5.6669 58.7595 19.0029 23.1123 7.7397 42.2318 5.6533 160.1604 4.7199 6.0587 56.1749 45.9155 30.0552 5.9311 5.1518 54.9354 18.2041 36.9992 5.6447 3.5772 26.6966 1.6270 194.7303 224.1369 14.2418 20.4931 62.6582 9.5630 123.3772 71.9960 48.7066 164.8001 7.5567 14.7617 13.4716 44.5577 16.5172 39.3386 51.7115 40.9239 42.5377 41.8834 40.2116 62.7403 6.9174 21.4638 27.1175 35.0396 21.5411 34.0442 9.4775 4.1180 5.2764 0.9593 2.2754
temp: 298.150 k
press: 1.00000 atm
elementType: 8 8 8 8 8 8 7 6 6 6 6 6 6 6 6 6 6 6 6 6 6 6 6 6 6 6 6 6 6 6 6 1 1 1 1 1 1 1 1 1 1 1 1 1 1 1 1 1 1 1 1 1 1 1 1 1 1 1 1 1
symmnumber: 1
zpe: 1281021.6 jmol-1
zpe.correction: 0.487915 hartree
zpe.thermalcorrener: 0.517906 hartree
zpe.thermalcorrenthalpy: 0.518850 hartree
zpe.thermalcorrgfe: 0.426488 hartree
zpe.sumelectzpe: -1435.651638 hartree
zpe.sumelectthermal: -1435.621647 hartree
zpe.sumelectthermalent: -1435.620703 hartree
zpe.sumelectthermalfe: -1435.713066 hartree
dipole: -2.2414 -2.5861 -1.4023
dipole: 3.6985
quadrupole: -167.1146 -180.1923 -157.1857
quadrupole: -2.7078 7.0773 1.5746
quadrupole: 1.0496 -12.0281 10.9785 -2.7078 7.0773 1.5746
hfenergy: -1436.1395535 hartree
pointgroup: C01 [X(C24H29N1O6)]
dipole: -0.9771819 0.9674946 0.4757544 debye
polarizability: 331.6381409|4.6847446|296.1807621|7.086484|-12.3899452|257.205733 unknown
InChI: InChI=1S/C24H29NO6/c1-24(25-7-5-6-8-25)13-17(16-11-19-20(30-14-29-19)12-18(16)31-24)23-21(27-3)9-15(26-2)10-22(23)28-4/h9-12,17H,5-8,13-14H2,1-4H3
charge 0 multiplicity 1
60 atoms
O  2.758284 0.019018 0.156364
O  -0.452631 -4.561396 0.015183
O  1.795488 -4.750278 0.820487
O  -0.90648 0.408841 1.843254
O  -1.997236 0.995722 -2.769466
O  -5.573839 1.368695 0.477759
N  3.202748 2.37986 -0.024308
C  2.38976 1.354387 -0.602154
C  0.887117 1.604843 -0.353156
C  -0.017725 0.446145 -0.854451
C  2.987043 2.742131 1.414632
C  4.654456 2.45961 -0.351468
C  4.389023 3.146447 1.943656
C  5.182128 3.497125 0.659481
C  2.731456 1.095981 -2.079324
C  0.521933 -0.917733 -0.404985
C  1.86106 -1.053679 0.063046
C  -1.473252 0.68743 -0.455419
C  -0.310232 -2.071914 -0.4780
C  2.383424 -2.312205 0.488662
C  -1.911986 0.657941 0.894952
C  -2.464133 0.965342 -1.440772
C  0.211918 -3.295817 -0.068705
C  1.532732 -3.410501 0.411643
C  -3.264881 0.871416 1.264881
C  -3.818511 1.188606 -1.110075
C  -4.206517 1.135833 0.246054
C  0.64218 -5.52142 0.285164
C  -1.298225 0.182551 3.234138
C  -2.973849 1.2398 -3.831789
C  -6.043399 1.327355 1.862773
H  0.599677 2.540543 -0.866226
H  0.722671 1.741915 0.727245
H  -0.009314 0.465189 -1.960509
H  2.582453 1.882175 1.981873
H  2.269399 3.581814 1.495557
H  4.807576 2.78322 -1.396261
H  5.167318 1.48232 -0.209441
H  4.342276 3.982433 2.662541
H  4.864308 2.28628 2.449941
H  6.27571 3.433978 0.79399
H  4.929765 4.517817 0.317362
H  2.535398 2.000591 -2.68239
H  3.789902 0.810663 -2.190508
H  2.123618 0.267861 -2.476807
H  -1.34397 -1.982579 -0.82447
H  3.411216 -2.383137 0.850411
H  -3.565749 0.83841 2.313494
H  -4.58456 1.398556 -1.85872
H  0.309937 -6.242155 1.047067
H  0.947648 -6.004267 -0.665288
H  -2.015336 -0.656553 3.31786
H  -1.734327 1.094895 3.687563
H  -0.363665 -0.077372 3.752743
H  -3.447786 2.234394 -3.722066
H  -3.755941 0.45641 -3.847244
H  -2.394573 1.205353 -4.76642
H  -7.122986 1.530631 1.806598
H  -5.550425 2.104261 2.479823
H  -5.875792 0.330818 2.316525
