program: Gaussian 09
title: 000147019
version: EM64L-G09RevD.01
frameworkgroup: C1[X(C14H13NO5S)]
method: RPBEPBE
basis: SDD
operation: Freq
keyword: #p
keyword: freq=noraman
keyword: PBEPBE/SDD
title: #p freq=noraman PBEPBE/SDD
converged: YES YES NO NO
title: Mulliken charges:
elementType: S O O O O O N C C C C C C C C C C C C C C H H H H H H H H H H H H H
charge: 0.964138 -0.213179 -0.152322 -0.627796 -0.544884 -0.573701 -0.074027 0.374033 0.404794 0.337587 -0.406096 -0.361589 -0.243467 -0.404004 -0.373383 -0.376581 0.272229 -0.234063 -0.232302 -0.230033 -0.771635 0.249863 0.249015 0.301942 0.281798 0.243106 0.239484 0.234395 0.233987 0.237780 0.244398 0.333636 0.253591 0.363283
chargesum: 0.00000
title: Mulliken charges with hydrogens summed into heavy atoms:
elementType: S O O O O O N C C C C C C C C C C C C C C
charge: 0.964138 -0.213179 -0.152322 -0.264513 -0.544884 -0.573701 -0.074027 0.374033 0.404794 0.337587 -0.156233 -0.112574 0.058475 -0.122207 -0.130277 -0.137097 0.272229 0.000332 0.001686 0.007748 0.059990
polarizability: 4.90043662e+02 2.41898103e-01 1.64551711e+02 -4.66080613e+00 2.37968040e+00 1.73398939e+02
1716.lowfreq: -6.2283 -1.3741 -0.0017 -0.0014 -0.0011 4.6900 20.7895 23.4715 31.8950
frequency: 20.5637 23.3864 31.8832 52.2692 66.2931 81.1052 89.6380 97.5554 119.2646 133.0186 161.7072 169.0526 169.9350 189.2027 229.5774 239.5391 270.0503 293.0208 305.1827 331.4023 355.9091 388.8165 397.2193 402.7652 408.3487 421.7890 443.4644 477.8516 494.1054 532.3467 538.1306 562.6779 595.6624 606.5404 611.7944 630.4324 649.3696 696.5604 729.2805 744.1538 775.6187 826.3021 846.4215 849.6689 872.1124 886.2089 927.4078 966.7026 972.1753 977.3847 978.9918 988.8257 993.4093 1000.5483 1013.2182 1013.9146 1033.5107 1039.1909 1089.1071 1116.5834 1131.1432 1165.1845 1177.2652 1195.6330 1218.9210 1295.7026 1307.9416 1310.6641 1320.9506 1367.7929 1383.0096 1399.3704 1432.2609 1432.4616 1441.5767 1467.4530 1478.4285 1503.5449 1553.9585 1582.5420 1604.7334 1611.7152 1713.0353 2964.5679 3067.4324 3130.1146 3131.8546 3133.7662 3145.2557 3152.5689 3155.7864 3158.6146 3170.5338 3179.4849 3223.8761 3468.8432
redmass: 7.9518 6.2581 5.4189 7.0991 6.2519 5.3138 4.5604 9.1433 6.6905 4.2355 1.7593 3.0523 4.5463 5.5553 6.5049 3.1790 8.7309 5.0460 4.8837 1.9981 3.1646 8.2303 3.6153 3.1898 3.1322 5.2180 6.3095 5.1580 5.6429 4.2696 3.1290 5.8246 9.9916 5.5986 6.1955 6.8354 6.4467 1.7451 3.4533 5.1475 1.9784 1.2921 1.5081 1.4473 7.6681 4.4371 1.4410 1.8270 2.0061 1.5537 1.3875 3.8876 5.8375 1.3314 1.8511 1.6222 1.5627 1.9208 1.6312 2.0379 1.4556 2.4530 1.0566 1.1283 1.3243 2.9988 1.4276 4.6999 1.5364 2.8018 9.1593 1.2290 1.7732 1.6221 2.5099 2.0404 1.0553 2.6659 6.3489 6.0509 5.8834 6.1793 10.3950 1.0460 1.0884 1.0851 1.1000 1.0878 1.0921 1.0906 1.0942 1.0914 1.1016 1.0958 1.0950 1.0661
irintensity: 0.8377 0.9190 0.0280 0.2262 0.0553 3.9650 4.5792 12.0802 3.6321 28.9037 17.9200 14.6044 47.4070 3.1660 5.0901 8.7986 10.3258 2.4273 30.6817 75.4397 61.4723 60.4260 3.1923 5.6707 3.2874 44.7357 58.6891 79.4013 125.7924 88.1004 4.0259 136.3583 272.0521 31.5757 1.7742 10.7230 8.4966 46.0661 27.7499 7.7364 56.2843 9.5543 10.0584 12.5670 56.4426 36.2824 1.8567 45.4030 37.5390 0.1745 2.8753 2.0733 8.7798 0.0269 27.1103 19.2233 2.6165 1.4553 8.3486 243.5766 29.3662 212.2767 0.3118 9.4494 3.4866 87.6446 4.6031 157.2772 33.4154 9.6436 2.4757 53.4235 19.2758 34.5163 1.5574 9.7688 19.2983 0.2271 6.4080 0.6763 352.1355 48.5163 118.3821 34.3006 3.7054 4.6533 5.3463 0.1795 9.3489 2.8289 24.1419 10.8327 40.7779 4.6196 2.5930 58.6419
temp: 298.150 k
press: 1.00000 atm
elementType: 16 8 8 8 8 8 7 6 6 6 6 6 6 6 6 6 6 6 6 6 6 1 1 1 1 1 1 1 1 1 1 1 1 1
symmnumber: 1
zpe: 634655.7 jmol-1
zpe.correction: 0.241728 hartree
zpe.thermalcorrener: 0.263004 hartree
zpe.thermalcorrenthalpy: 0.263948 hartree
zpe.thermalcorrgfe: 0.189234 hartree
zpe.sumelectzpe: -1368.516001 hartree
zpe.sumelectthermal: -1368.494725 hartree
zpe.sumelectthermalent: -1368.493781 hartree
zpe.sumelectthermalfe: -1368.568495 hartree
dipole: 6.4176 -2.8725 1.6547
dipole: 7.2232
quadrupole: -109.5036 -140.9863 -123.7153
quadrupole: 15.1823 -0.0563 3.9150
quadrupole: 15.2315 -16.2512 1.0198 15.1823 -0.0563 3.9150
hfenergy: -1368.7577288 hartree
pointgroup: C01 [X(C14H13N1O5S1)]
dipole: -2.437668 0.7914236 1.2277911 debye
polarizability: 488.7711983|-18.3687352|169.7297924|-9.8630548|-4.4319226|169.4933212 unknown
InChI: InChI=1S/C14H12NO2.HO3S/c1-11(16)15(17)14-9-7-13(8-10-14)12-5-3-2-4-6-12;1-4(2)3/h2-10H,1H3;1H
charge 0 multiplicity 1
34 atoms
S  3.80513 -1.804992 -0.999157
O  2.842434 -0.468013 1.805327
O  2.643086 2.445482 -0.169026
O  5.610609 -1.220687 -0.844164
O  2.980127 -0.259049 -1.119805
O  3.69998 -2.454685 -2.48397
N  2.33352 0.284475 0.883153
C  -1.898019 0.086598 0.253878
C  0.913655 0.229633 0.630912
C  -3.368654 0.020898 0.059109
C  -1.053552 0.708678 -0.714237
C  -1.283331 -0.478152 1.412089
C  0.335679 0.782786 -0.54436
C  0.102909 -0.416356 1.602469
C  -4.05404 1.036972 -0.666767
C  -4.130969 -1.058226 0.591947
C  3.218139 1.499014 0.377799
C  -5.45011 0.977565 -0.851241
C  -5.526192 -1.120697 0.401795
C  -6.193337 -0.102389 -0.319323
C  4.644304 1.390096 0.825623
H  -1.488595 1.096061 -1.640595
H  -1.905632 -0.934886 2.18772
H  0.971803 1.206056 -1.320595
H  0.572792 -0.836801 2.495699
H  -3.496695 1.894893 -1.058393
H  -3.625703 -1.871721 1.124204
H  -5.959728 1.7752 -1.402315
H  -6.09245 -1.96611 0.807118
H  -7.277837 -0.150301 -0.465308
H  5.163098 2.316497 0.537415
H  5.142441 0.519585 0.356719
H  4.697617 1.249225 1.919347
H  5.930624 -1.046749 -1.777466
