program: Gaussian 09
title: 000146921
version: EM64L-G09RevD.01
frameworkgroup: C1[X(C8H7NO3S2)]
method: RPBEPBE
basis: SDD
operation: Freq
keyword: #p
keyword: freq=noraman
keyword: PBEPBE/SDD
title: #p freq=noraman PBEPBE/SDD
converged: YES YES NO NO
title: Mulliken charges:
elementType: S S O O O N C C C C C C C C H H H H H H H
charge: 0.962608 0.350275 -0.522358 -0.531152 -0.422886 -0.699276 0.640862 -0.346268 -0.432293 -0.229814 -0.372857 -0.443565 0.303965 -0.351450 0.308703 0.252841 0.245079 0.260803 0.324262 0.341048 0.361474
chargesum: 0.00000
title: Mulliken charges with hydrogens summed into heavy atoms:
elementType: S S O O O N C C C C C C C C
charge: 0.962608 0.350275 -0.522358 -0.531152 -0.061413 -0.033966 0.640862 -0.346268 -0.432293 0.078888 -0.120016 -0.198487 0.303965 -0.090647
polarizability: 2.39931040e+02 -6.13317487e+00 1.43378685e+02 6.43810813e-01 1.14347313e+00 7.60199736e+01
1716.lowfreq: -9.1747 -5.4433 -0.0024 -0.0024 -0.0020 4.8111 27.3238 56.9020 95.8115
frequency: 27.2752 56.8981 95.8064 116.7948 172.9858 189.2406 204.1948 223.9267 250.5453 267.2108 311.3363 335.2222 371.2279 382.6457 402.3840 413.1802 427.7762 459.3398 484.8867 510.8787 519.0195 590.8341 642.9359 680.8044 727.3814 785.0072 801.4050 803.2197 819.6247 828.4884 860.7357 894.7588 911.4674 923.4364 964.6780 1028.3340 1069.8391 1120.4189 1143.3420 1168.4859 1223.3385 1288.0234 1306.2462 1401.4963 1422.1077 1467.7927 1517.1524 1533.2206 1582.3226 1614.8556 3135.3655 3150.5491 3181.9879 3188.0009 3365.9837 3534.9884 3581.6913
redmass: 7.0739 7.6726 8.8123 2.8241 2.4125 5.4342 9.9757 8.0656 2.6438 4.4518 6.2646 8.3896 1.1562 5.9036 8.3295 7.8265 2.8170 4.8203 5.3407 6.0293 5.5587 3.3843 7.2593 7.8436 3.5308 1.9369 8.2573 3.8252 1.3429 1.5772 7.7310 1.4242 4.5636 4.7372 1.3646 2.7139 1.4634 1.4878 1.2906 1.3413 1.6979 2.4654 2.4201 3.9527 4.9180 3.8920 5.3340 1.1228 6.5260 6.9136 1.0923 1.0899 1.0963 1.0955 1.0413 1.1004 1.0662
irintensity: 1.4429 1.7373 0.2079 14.1710 20.9575 0.1118 3.8965 1.1363 12.7837 1.7563 8.4789 1.8041 134.3658 14.2581 98.5997 39.5665 24.1327 81.1097 32.9920 33.2708 66.5091 14.8040 1.6159 1.7977 0.2116 118.9434 96.3872 40.5878 0.0620 54.3138 19.5218 41.3341 78.8947 113.7929 0.9677 39.9075 38.1157 100.6730 186.7870 10.9772 21.8681 11.4128 15.0582 12.0785 13.3150 70.3946 45.0831 38.0004 14.0683 177.7666 8.3206 3.6611 5.5582 4.4751 31.0495 24.4079 67.5040
temp: 298.150 k
press: 1.00000 atm
elementType: 16 16 8 8 8 7 6 6 6 6 6 6 6 6 1 1 1 1 1 1 1
symmnumber: 1
zpe: 361769.2 jmol-1
zpe.correction: 0.137791 hartree
zpe.thermalcorrener: 0.151602 hartree
zpe.thermalcorrenthalpy: 0.152546 hartree
zpe.thermalcorrgfe: 0.096638 hartree
zpe.sumelectzpe: -1384.386660 hartree
zpe.sumelectthermal: -1384.372849 hartree
zpe.sumelectthermalent: -1384.371905 hartree
zpe.sumelectthermalfe: -1384.427813 hartree
dipole: -3.7552 -1.1814 3.1818
dipole: 5.0617
quadrupole: -95.1446 -89.6173 -99.8690
quadrupole: 3.6320 14.4680 -0.1189
quadrupole: -0.2676 5.2597 -4.9920 3.6320 14.4680 -0.1189
hfenergy: -1384.5244504 hartree
pointgroup: C01 [X(C8H7N1O3S2)]
dipole: 1.4996952 -0.3480405 -1.2631747 debye
dipolederiv: 2.7965835 0.0479464 0.2399218 0.0034524 1.1625598 0.0260615 0.2378555 0.0552084 1.6331998 -0.294706 0.0496807 -0.0023291 -0.2754477 -0.0892045 -0.0302272 -0.0247616 -0.0262411 0.144334 -0.8387023 -0.0473417 0.0099775 -0.1369756 -0.5131893 0.14498 -0.009138 -0.0013896 -0.5591031 -0.8035307 0.0555352 -0.0211996 0.1660529 -0.6663443 -0.1356846 -0.0367485 0.0190073 -0.5310784 -1.6494231 0.4072145 0.0208228 0.6373453 -0.2466417 0.0260607 0.0593851 0.0199651 -0.4159909 -0.8016996 0.0125636 -0.1134618 -0.0819501 -0.446015 -0.1420826 -0.1997907 -0.1702331 -0.8075704 -0.4610508 0.1000701 -0.0054392 -0.0594099 -0.2726174 -0.0359048 -0.0214822 -0.0373545 0.0360839 0.5796945 0.129379 0.0236199 0.12738 0.1244435 0.0252925 0.0131401 0.0207544 -0.0751035 -0.8597868 -0.1701118 -0.0258688 -0.2695627 0.2381127 0.0724331 0.0589534 0.0815702 -0.3256824 0.3630737 -0.1574801 -0.0055037 0.309338 -0.1783512 0.0074377 0.0404417 -0.0002592 -0.0911462 0.4188176 -0.0056326 0.0082482 0.0683355 0.1390087 0.0309508 0.009559 0.0327177 -0.1223065 -0.6937243 0.0435125 -0.0060729 -0.3090827 -0.0070822 0.010014 -0.0379438 0.0166097 -0.1703116 1.5233167 -0.3751474 -0.0186195 -0.5336856 0.4020782 0.0262908 -0.043884 0.0305774 0.0924456 -0.2835892 0.1039722 0.0064303 0.4939617 -0.1454739 0.011355 0.0542195 0.0046491 -0.1709393 0.128214 0.0135274 0.0058575 0.039582 0.0691545 -0.0126754 0.0111343 -0.0126195 0.1836041 0.0811634 0.0431898 0.0044638 -0.0069348 -0.0576923 -0.0237187 -0.0019071 -0.0237141 0.1567607 0.050752 0.0253659 0.0013792 0.0693658 -0.0454188 -0.0231081 0.0052768 -0.0239929 0.1800468 -0.0149589 -0.0728011 -0.010388 -0.0628066 0.059903 -0.0131569 -0.0082456 -0.0133197 0.1728832 0.2364257 -0.0166712 -0.1096436 -0.0361983 0.0864117 -0.0054148 -0.0355736 0.0295833 0.1694445 0.1109419 -0.0548635 0.0095075 0.008806 0.2862495 0.0730918 -0.0533702 0.029014 0.1146412 0.4121888 -0.131908 -0.0117025 -0.1515656 0.1001092 -0.0319947 -0.01712 -0.0305328 0.3857884 unknown
polarizability: 239.9903874|3.7528258|142.5174966|5.2586753|6.7221456|76.8218145 unknown
InChI: InChI=1S/C8H7NO3S2/c9-14(11,12)8-3-5-1-2-6(10)4-7(5)13-8/h1-4,10H,9H2
charge 0 multiplicity 1
21 atoms
S  -3.24505 0.104444 0.006368
S  -0.542388 -1.55994 -0.198304
O  -3.847424 -1.054936 0.97114
O  -3.611197 1.680223 0.209864
O  4.742359 -0.767071 -0.06025
N  -3.67613 -0.462346 -1.688957
C  0.807182 0.767714 0.066498
C  1.02291 -0.641446 -0.083502
C  -1.406442 0.017758 -0.036545
C  -0.596029 1.12011 0.092093
C  1.94208 1.621546 0.169863
C  2.31227 -1.20604 -0.131281
C  3.413343 -0.325282 -0.025743
C  3.232143 1.079959 0.123939
H  -0.988623 2.132772 0.20934
H  1.802422 2.701082 0.287012
H  2.460494 -2.286188 -0.244574
H  4.121668 1.710765 0.201876
H  -3.742923 0.350801 -2.323141
H  -4.553306 -1.005157 -1.620791
H  4.797543 -1.750068 -0.159204
