program: Gaussian 09
title: 000010138
version: EM64L-G09RevD.01
frameworkgroup: C1[X(C16H12O6)]
method: RPBEPBE
basis: SDD
operation: Freq
keyword: #pfreq=noraman
keyword: PBEPBE/SDD
title: #p freq=noraman PBEPBE/SDD
converged: YES YES NO NO
title: Mulliken charges:
elementType: O O O O O O C C C C C C C C C C C C C C C C H H H H H H H H H H H H
charge: -0.315723 -0.425339 -0.394171 -0.409361 -0.291402 -0.383472 0.039784 0.218201 -0.650194 0.227984 0.349752 -0.402646 0.354916 0.034702 -0.452637 -0.548600 -0.338902 -0.029472 0.130532 0.055142 -0.405087 0.178736 0.278042 0.235232 0.259799 0.228255 0.240172 0.357412 0.270092 0.231116 0.230127 0.383472 0.377964 0.365575
chargesum: 0.00000
title: Mulliken charges with hydrogens summed into heavy atoms:
elementType: O O O O O O C C C C C C C C C C C C C C C C
charge: -0.315723 -0.067927 -0.010699 -0.031397 -0.291402 -0.017897 0.039784 0.218201 -0.136920 0.227984 0.349752 0.085408 0.354916 0.034702 -0.212465 -0.278509 -0.107786 -0.029472 0.130532 0.055142 -0.174961 0.178736
polarizability: 4.52871528e+02 8.13237466e+00 2.13321123e+02 6.08205022e+00 8.13068222e+00 9.29370898e+01
1716.lowfreq: -3.6488 -0.0004 0.0005 0.0007 5.6394 7.5617 32.8026 47.1912 81.5810
frequency: 32.7514 47.1741 81.5797 107.1393 120.5066 143.6836 165.2739 194.7066 225.2373 230.0525 269.1824 277.6980 295.1678 308.0446 316.4382 321.2589 329.3227 350.0581 375.1844 404.7118 415.8922 421.7527 428.7769 467.0638 492.3009 510.4462 530.7129 539.1533 557.6810 589.2229 597.7908 618.3727 640.9533 671.5389 689.6780 701.5267 719.2432 729.9168 736.2672 752.2327 770.0523 779.0240 825.3880 836.7052 842.9099 869.3135 878.9375 909.2851 913.8221 965.7514 996.6265 1024.1366 1050.5782 1087.7687 1130.0036 1137.8367 1148.8937 1173.0046 1176.6316 1183.6849 1196.8200 1212.9404 1220.0470 1235.1856 1262.6584 1271.3067 1276.6003 1313.5058 1324.3996 1334.0974 1356.5552 1375.3755 1406.8935 1424.1648 1438.2389 1441.7658 1449.0879 1509.5532 1515.1235 1575.9140 1579.4280 1608.0763 1628.4555 1649.3877 2993.8204 3000.9702 3077.2782 3108.3503 3129.4654 3157.7592 3185.3343 3202.2219 3254.8403 3505.6823 3539.8466 3575.2628
redmass: 5.7848 7.5279 6.8882 4.4999 6.3838 5.7678 3.6438 5.7542 5.4880 6.4339 2.8583 5.0895 6.1165 3.4229 2.0524 4.4494 4.1197 3.0448 1.1782 4.1647 5.8956 3.2834 6.9931 5.5189 1.1623 5.2619 5.5646 4.4578 5.8203 4.5657 6.7618 4.3369 5.1819 5.6580 4.1304 6.4874 1.3045 3.8871 5.0504 3.4373 5.0984 1.7414 4.8424 2.7394 1.8006 1.9305 3.3169 1.3529 2.2527 2.5725 5.9406 3.8453 2.1447 2.0225 3.4789 2.0826 1.7259 2.3473 1.7315 1.8654 1.4889 1.8120 1.4843 1.3137 2.2288 2.2428 1.8672 1.5946 1.8626 2.6208 2.6425 2.2386 3.8639 3.7238 3.1721 1.2145 1.2639 4.2247 6.9552 8.7842 8.5466 7.5112 6.1232 7.2744 1.0660 1.0642 1.0957 1.1020 1.0905 1.0930 1.0927 1.0912 1.0624 1.0646 1.0656 1.0662
irintensity: 2.6265 0.0778 0.3353 3.2281 2.1581 0.5312 6.0027 3.2745 11.4333 1.7572 22.0596 5.4166 33.4695 5.3792 49.7717 14.2964 40.2957 4.2464 110.0872 5.5973 1.5880 4.4650 10.3758 22.2163 134.9731 12.3124 32.8134 14.0195 8.8848 1.2257 15.5756 17.1129 28.0352 1.2716 26.7964 6.3602 103.5591 4.3265 11.0042 18.4840 15.6223 25.6307 20.0757 4.7795 33.3286 11.9545 23.0803 0.3348 17.8946 11.7774 141.0296 72.6286 64.4502 40.3211 17.3739 67.1783 170.3441 186.9217 342.1773 12.6068 64.8026 293.2258 163.0678 50.0794 44.9436 123.9302 55.0373 11.5895 87.6909 22.9766 18.7003 84.3210 193.6881 474.8282 156.8983 21.7639 80.0365 2.9454 158.7970 136.3955 34.4980 202.4297 214.3406 0.7475 5.9860 42.1742 2.1272 11.5633 15.7849 5.1569 3.5757 6.0929 99.3563 73.7083 12.2145 128.4720
temp: 298.150 k
press: 1.00000 atm
elementType: 8 8 8 8 8 8 6 6 6 6 6 6 6 6 6 6 6 6 6 6 6 6 1 1 1 1 1 1 1 1 1 1 1 1
symmnumber: 1
zpe: 648630.0 jmol-1
zpe.correction: 0.247050 hartree
zpe.thermalcorrener: 0.265195 hartree
zpe.thermalcorrenthalpy: 0.266139 hartree
zpe.thermalcorrgfe: 0.201744 hartree
zpe.sumelectzpe: -1066.668177 hartree
zpe.sumelectthermal: -1066.650032 hartree
zpe.sumelectthermalent: -1066.649088 hartree
zpe.sumelectthermalfe: -1066.713484 hartree
dipole: 4.2439 -0.6545 -1.0007
dipole: 4.4091
quadrupole: -161.5552 -106.4669 -128.7943
quadrupole: 13.1026 2.9639 8.3607
quadrupole: -29.2830 25.8052 3.4778 13.1026 2.9639 8.3607
hfenergy: -1066.9152272 hartree
pointgroup: C01[X(C16H12O6)]
dipole: 1.6658842 -0.2829432 -0.3922582 debye
polarizability: 453.0016594|1.7024335|212.1915069|9.2962469|12.9583753|93.936575 unknown
InChI: InChI=1S/C16H12O6/c17-10-2-1-8-13-9-4-12(19)11(18)3-7(9)5-16(13,21)6-22-15(8)14(10)20/h1-4,17,19-21H,5-6H2
charge 0 multiplicity 1
34 atoms
O  2.290165 -1.897198 -0.431878
O  0.176389 -2.426287 1.499151
O  4.725863 -0.76981 -0.411851
O  -4.034062 2.741269 -0.026395
O  -5.592901 0.609246 -0.193074
O  5.087139 1.899959 0.135695
C  -0.109657 -1.940614 0.12471
C  -0.142316 -0.4037 0.082649
C  -1.551198 -2.388905 -0.192638
C  -1.470806 0.048573 0.02035
C  -2.366353 -1.109955 -0.106637
C  0.971816 -2.465193 -0.827045
C  1.139041 0.27433 0.105522
C  2.311065 -0.510892 -0.151528
C  -2.026767 1.381032 0.032598
C  -3.736456 -0.977796 -0.179857
C  1.351483 1.66053 0.37882
C  3.617165 0.027428 -0.141624
C  -3.399069 1.51625 -0.037985
C  -4.329046 0.348472 -0.136533
C  2.640845 2.209847 0.400906
C  3.784051 1.407071 0.138506
H  -1.868591 -3.150491 0.538597
H  -1.628528 -2.83629 -1.202756
H  1.100994 -3.555146 -0.741151
H  0.762678 -2.176161 -1.875418
H  -1.406996 2.277034 0.088287
H  1.081318 -2.118024 1.768332
H  -4.407799 -1.836269 -0.278753
H  0.50266 2.301706 0.619585
H  2.774588 3.274014 0.630594
H  4.406108 -1.691604 -0.606779
H  -5.02068 2.531174 -0.084645
H  5.096555 2.872097 0.322943
