program: Gaussian 09
title: 000146916
version: EM64L-G09RevD.01
frameworkgroup: C1[X(C7H13N3O2)]
method: RPBEPBE
basis: SDD
operation: Freq
keyword: #p
keyword: freq=noraman
keyword: PBEPBE/SDD
title: #p freq=noraman PBEPBE/SDD
converged: YES YES NO NO
title: Mulliken charges:
elementType: O O N N N C C C C C C C H H H H H H H H H H H H H
charge: -0.417853 -0.243320 -0.388741 -0.432041 -0.155630 -0.391367 -0.376891 -0.387753 0.262941 -0.456930 -0.455965 0.182827 0.263757 0.220850 0.223315 0.215091 0.227852 0.215358 0.218057 0.221429 0.285137 0.278423 0.254801 0.262479 0.374176
chargesum: 0.00000
title: Mulliken charges with hydrogens summed into heavy atoms:
elementType: O O N N N C C C C C C C
charge: -0.043677 -0.243320 -0.103604 -0.153618 -0.155630 0.093239 0.061515 0.055457 0.262941 -0.017445 0.061315 0.182827
polarizability: 1.25786238e+02 1.07942187e+01 9.09019674e+01 5.43221909e+00 4.13686209e+00 9.08018359e+01
1716.lowfreq: -18.3367 -9.4523 0.0008 0.0010 0.0010 1.1088 8.8681 23.0653 37.5153
frequency: -14.5044 23.0496 36.9566 77.8312 96.6915 126.0584 147.1512 206.3111 251.3534 266.1575 343.8768 411.3480 422.7434 431.7061 496.7961 522.1043 597.1975 644.5569 652.1416 714.7437 730.4072 768.6530 830.5033 841.0615 890.0406 905.4287 931.1496 951.6091 1010.7495 1040.2434 1051.1227 1076.3644 1086.1883 1113.5108 1125.0656 1170.5275 1175.1385 1204.5759 1222.9661 1245.1193 1259.2087 1273.7766 1280.1403 1305.3683 1325.3747 1356.1407 1374.5676 1407.4974 1438.8705 1469.6136 1478.2196 1480.1358 1496.5443 1523.0057 1635.1773 1662.6473 2963.5303 2966.2465 2983.6549 2987.5742 2996.4385 3029.4161 3042.9153 3050.8164 3066.8789 3074.7605 3507.4206 3542.6842 3557.4842
redmass: 4.6590 10.1931 4.0973 2.6611 2.0372 2.8100 4.5794 3.4693 2.2333 3.8832 1.2747 2.7341 2.2152 3.3866 1.9139 1.7897 3.4822 6.9004 1.4296 3.4414 4.4229 1.4963 1.3211 2.5492 4.2328 3.1410 2.9206 2.6154 3.0314 2.8112 2.7994 2.1947 1.7614 2.5367 2.8000 1.1625 1.3417 1.0998 1.2629 1.4756 1.4402 1.4892 1.1536 1.3147 1.5709 1.3567 1.7009 1.6245 1.0868 1.1137 1.0927 1.0762 1.1413 1.9111 6.5319 8.1352 1.0645 1.0673 1.0653 1.0642 1.0615 1.0979 1.0988 1.1047 1.0954 1.0964 1.0638 1.0781 1.0765
irintensity: 3.0024 2.0195 4.6613 1.7258 2.8902 5.9435 8.4496 6.6246 2.7753 5.0977 82.4315 45.1574 42.2447 118.1294 131.0170 18.9853 16.4544 11.5469 118.1926 12.6787 7.4198 21.7919 1.4827 1.6884 4.3853 15.6389 7.8538 13.5029 32.5398 86.9977 148.7219 7.4355 6.5729 53.6380 4.8371 4.8053 2.1637 0.7219 56.3264 9.2736 60.1844 64.3831 7.1346 38.0109 35.8233 6.3210 40.9616 28.9268 15.1194 52.0261 9.2833 12.5547 17.0914 182.9728 380.1151 199.3335 76.9207 44.5466 12.6102 88.2344 44.5611 33.5982 15.6002 72.7936 5.4125 24.0256 18.7386 4.5135 18.4868
temp: 298.150 k
press: 1.00000 atm
elementType: 8 8 7 7 7 6 6 6 6 6 6 6 1 1 1 1 1 1 1 1 1 1 1 1 1
symmnumber: 1
zpe: 540564.4 jmol-1
zpe.correction: 0.205890 hartree
zpe.thermalcorrener: 0.217967 hartree
zpe.thermalcorrenthalpy: 0.218911 hartree
zpe.thermalcorrgfe: 0.165539 hartree
zpe.sumelectzpe: -588.295803 hartree
zpe.sumelectthermal: -588.283726 hartree
zpe.sumelectthermalent: -588.282782 hartree
zpe.sumelectthermalfe: -588.336153 hartree
dipole: -1.0156 -0.9170 2.1580
dipole: 2.5552
quadrupole: -71.5461 -67.9941 -72.0950
quadrupole: -0.3880 -9.3562 -2.1436
quadrupole: -1.0010 2.5510 -1.5500 -0.3880 -9.3562 -2.1436
hfenergy: -588.5016929 hartree
pointgroup: C01 [X(C7H13N3O2)]
dipole: -0.3872115 0.7688264 -0.5192369 debye
dipolederiv: -0.4732722 -0.1439372 -0.3437043 -0.1596875 -0.6534281 -0.3996419 -0.3441391 -0.3644687 -0.9136927 -0.7702077 -0.0474254 0.3122672 -0.1805054 -0.4277065 -0.0687468 0.1317913 -0.1772664 -0.814162 -1.5249778 0.22562 0.2665139 0.1419648 -0.5798487 -0.0756738 0.1996482 -0.0609535 -0.3224507 -0.8068049 0.4077124 -0.2626265 0.2861823 -0.5131626 0.0616223 -0.1221323 0.0511191 -0.7452458 -0.7579227 0.0854202 0.1678062 -0.0170224 -0.5040038 0.1705085 0.463244 0.0842055 -0.8658825 0.5451073 -0.1542935 0.0832778 -0.2650294 0.4364047 0.0787176 0.2957817 -0.0674996 0.1035731 -0.0297098 -0.0130203 -0.0134694 -0.0040706 0.1075479 -0.0374875 0.0545749 -0.0101995 0.1304373 0.4287798 -0.084496 0.0118261 0.064889 0.1739396 0.1833582 -0.1456635 0.3016415 0.131752 1.5633722 -0.5547761 -0.2746277 -0.5710308 0.6774829 -0.3766534 -0.697032 -0.2313819 1.0341071 0.468433 0.0259607 -0.1545477 -0.0450969 0.2343741 0.1074398 -0.1078951 0.0370053 0.3211931 -0.4459739 -0.1749195 0.0005844 -0.0750768 0.019011 -0.0656399 0.0626277 -0.0700854 0.0201298 1.2320512 0.3864949 -0.0853643 0.4790209 0.5927629 0.4685128 -0.0008899 0.5081415 1.3224839 0.1243537 -0.0372047 0.02286 0.0099297 0.1017723 0.0012867 -0.0066006 0.0527369 -0.0146772 -0.0505898 -0.0043591 -0.0377343 0.0650798 -0.1839216 -0.1105923 -0.063906 -0.1423815 0.0138126 0.0769983 0.001421 0.042969 -0.0473308 0.0657878 0.0432839 0.0445095 0.0182777 -0.1128859 -0.034168 0.1103501 -0.0290039 0.0972891 -0.1002294 0.0275515 -0.0807996 0.0555838 0.0579135 -0.1969095 0.0618247 -0.0756191 0.0143053 0.0613487 -0.01954 -0.1067468 -0.002162 0.0298001 0.0170958 -0.032349 -0.0056525 0.0483773 -0.2126964 -0.0864648 0.0492742 -0.1161747 0.0374307 0.0329045 0.0011515 0.0278676 0.0862538 0.0183299 -0.1332538 0.067022 -0.0780755 -0.1618875 -0.1883857 -0.1039575 0.0848834 -0.1154537 -0.0397152 0.0105771 -0.0246916 0.0078388 0.0686171 0.2403525 0.0890165 -0.0053342 0.198057 0.2146214 0.0212757 0.0295895 0.0736403 0.1072874 0.162148 -0.0170605 0.1501152 0.0428522 0.1310354 0.1527442 0.127005 0.053064 0.2577351 0.1050652 -0.0194976 0.0211374 -0.0507907 0.0642543 0.0279956 0.0022961 0.012982 -0.0712545 0.1404005 0.0903888 0.0142344 0.0676865 -0.0299085 0.0155994 0.0439154 0.0461966 0.0976929 0.1418602 -0.0980644 0.0813412 -0.0707929 0.3459479 0.0032208 0.1292171 0.0182158 0.2881733 unknown
polarizability: 126.9066713|-5.3289324|86.8502346|-9.0269668|1.1532363|93.7331357 unknown
InChI: InChI=1S/C7H13N3O2/c11-6(12)2-1-3-8-7-9-4-5-10-7/h8-9,11H,1-5H2
charge 0 multiplicity 1
25 atoms
O  3.662732 1.346406 1.506104
O  4.016673 0.560481 -0.647148
N  -0.681629 -0.49103 -1.027469
N  -2.691368 0.846807 -1.056246
N  -2.304542 -0.570754 0.74504
C  0.156648 -1.561769 -0.459296
C  1.649634 -1.170409 -0.414643
C  -3.774781 1.222836 -0.111171
C  -1.866896 -0.106852 -0.411111
C  -3.596647 0.133385 1.017652
C  1.899813 0.024335 0.526046
C  3.276223 0.629984 0.360155
H  -0.237297 -1.755905 0.553163
H  0.038414 -2.498571 -1.04216
H  2.016154 -0.919203 -1.428576
H  2.236704 -2.047136 -0.079695
H  -4.76734 1.170266 -0.591909
H  -3.628388 2.249427 0.282518
H  -3.584306 0.584803 2.0263
H  -4.425385 -0.599776 0.990432
H  -0.577738 -0.285986 -2.021947
H  -2.297052 1.546452 -1.687787
H  1.748328 -0.245914 1.585669
H  1.156319 0.817168 0.302236
H  4.556624 1.755754 1.345042
