program: Gaussian 09
title: 000146903
version: EM64L-G09RevD.01
frameworkgroup: C1[X(C8H12O5)]
method: RPBEPBE
basis: SDD
operation: Freq
keyword: #pfreq=noraman
keyword: PBEPBE/SDD
title: #p freq=noraman PBEPBE/SDD
converged: YES YES NO NO
title: Mulliken charges:
elementType: O O O O O C C C C C C C C H H H H H H H H H H H H
charge: -0.417343 -0.139227 -0.229091 -0.372459 -0.207228 -0.356684 -0.369911 -0.374195 -0.497941 -0.486468 0.123463 0.172318 0.105711 0.190372 0.190410 0.221084 0.220740 0.221234 0.219610 0.258141 0.258936 0.251755 0.252262 0.376560 0.387949
chargesum: 0.00000
title: Mulliken charges with hydrogens summed into heavy atoms:
elementType: O O O O O C C C C C C C C
charge: -0.040783 -0.139227 -0.229091 0.015490 -0.207228 0.024098 0.071913 0.066650 0.019136 0.017550 0.123463 0.172318 0.105711
polarizability: 1.32663582e+02 -1.73559223e+00 1.02879385e+02 1.71967276e-01 -5.14764096e-02 6.46285599e+01
1716.lowfreq: 0.0006 0.0006 0.0009 2.6755 4.5623 11.2683 12.8550 27.4124 34.7966
frequency: 11.9187 27.3335 34.0305 46.0270 60.8079 75.8300 118.3038 127.5491 136.3688 180.4671 220.4455 311.0799 365.1424 374.8997 390.0313 475.9584 501.0849 521.6483 587.1270 599.2399 616.8034 635.7942 662.6627 725.3154 757.5862 785.0315 833.5596 860.4463 937.7005 967.6929 1016.0281 1045.3600 1060.1931 1083.0564 1085.0590 1093.0137 1113.7161 1123.4573 1214.8648 1225.4903 1253.6510 1265.5659 1292.4038 1292.9701 1294.3728 1314.9495 1348.4717 1370.9714 1376.8770 1416.8017 1439.1723 1465.1358 1470.6095 1485.4202 1622.6176 1641.8504 1669.9417 2954.8231 2969.1527 2987.6141 2993.7281 2998.5653 2999.4877 3007.7245 3031.7878 3053.4791 3066.3536 3507.1741 3513.3342
redmass: 12.9743 6.2014 5.1562 6.5300 2.0676 2.8270 7.1732 1.8925 2.1765 8.4012 5.9681 6.9392 3.1356 4.9114 5.1074 4.9087 1.7748 5.1254 4.7797 1.3518 4.0494 1.3303 1.9004 1.1189 1.3983 6.1582 1.5746 4.6533 1.4897 5.8469 3.3870 3.2036 2.6834 2.0272 1.6406 2.5229 2.7092 1.3066 1.3906 1.3352 1.5245 1.1666 1.5385 1.1254 1.1153 2.1355 1.7583 1.7247 1.8280 1.0934 1.0849 1.0684 1.0883 1.0978 10.4142 9.8616 8.2663 1.0592 1.0618 1.0613 1.0604 1.0974 1.0610 1.0961 1.0988 1.1031 1.1031 1.0643 1.0639
irintensity: 0.6181 0.8491 3.7170 0.0462 0.1530 0.5292 1.0829 0.0083 0.7672 1.4137 8.4239 3.5453 3.1294 38.0154 3.0024 6.7411 29.8986 2.0805 7.5696 68.3439 82.7176 130.6607 109.4405 12.5689 2.6515 2.7042 4.9359 0.8976 0.1511 269.0307 41.1115 46.0145 206.9218 0.7657 0.7456 3.6808 27.5686 0.6131 0.0358 33.4212 32.6891 0.0611 0.6814 0.1534 0.5089 23.1121 44.3296 2.8127 21.5413 33.2202 28.0841 0.1486 0.9798 22.0504 182.7366 78.3669 215.1774 23.2889 14.6448 5.3401 5.6157 14.4672 44.7585 0.0456 0.1238 5.8559 88.5019 37.0284 19.3071
temp: 298.150 k
press: 1.00000 atm
elementType: 8 8 8 8 8 6 6 6 6 6 6 6 6 1 1 1 1 1 1 1 1 1 1 1 1
symmnumber: 1
zpe: 509089.6 jmol-1
zpe.correction: 0.193902 hartree
zpe.thermalcorrener: 0.208725 hartree
zpe.thermalcorrenthalpy: 0.209669 hartree
zpe.thermalcorrgfe: 0.147488 hartree
zpe.sumelectzpe: -687.155846 hartree
zpe.sumelectthermal: -687.141023 hartree
zpe.sumelectthermalent: -687.140079 hartree
zpe.sumelectthermalfe: -687.202260 hartree
dipole: -0.1899 -2.9117 0.0234
dipole: 2.9180
quadrupole: -63.1253 -92.5079 -73.4193
quadrupole: -1.2956 0.2521 0.0461
quadrupole: 13.2255 -16.1570 2.9315 -1.2956 0.2521 0.0461
hfenergy: -687.349748 hartree
pointgroup: C01 [X(C8H12O5)]
dipole: 0.0800458 -1.1451181 -0.0162916 debye
dipolederiv: -1.0686598 -0.5393787 -0.0238216 -0.4732254 -0.601212 -0.0092076 -0.0248474 -0.0102965 -0.4335437 -0.5723325 0.0145697 -0.0005663 -0.0975361 -0.6986944 0.0026329 0.0000669 0.0025105 -0.2551903 -0.6887818 0.1476002 0.004816 -0.1086659 -0.9629792 -0.0262635 -0.006524 -0.0233887 -0.3041366 -1.0974506 -0.5105366 0.0040069 -0.3929103 -0.4749006 0.0001496 0.0016414 -0.0004369 -0.394317 -0.6861399 0.1334331 -0.0017529 -0.2105429 -0.8636839 0.004314 0.0011455 0.0060144 -0.2956804 -0.0213611 -0.0020474 0.000477 0.0112786 0.0999534 -0.0000674 -0.000216 -0.0000659 0.196591 0.0020734 0.0033405 0.0001471 0.0186585 0.0650072 -0.0003658 0.0014568 0.0004632 0.1512076 0.0293644 -0.0026882 -0.000121 -0.0226684 0.0520723 -0.0015772 0.0018626 -0.0028152 0.153904 -0.3266895 -0.1577034 -0.0002636 -0.3912901 -0.2147989 0.0010707 -0.0025973 -0.0003563 0.1235841 -0.2678534 0.0998466 0.0002252 0.2949527 -0.099713 -0.0052219 -0.0001279 -0.0042033 0.155719 1.0323864 0.1033123 0.0014314 0.2670907 0.7855838 -0.0028007 0.0008889 -0.0025396 0.1665787 1.5248493 0.1834288 0.0163094 0.2514587 1.3680778 0.0464903 0.0250961 0.0451415 0.1865408 1.1418458 0.3081009 -0.0012675 0.489684 1.0932849 -0.0069737 -0.0017084 -0.0078857 0.2223759 0.0355585 0.0058441 -0.0065858 0.0031645 -0.039842 0.1147814 -0.0071073 0.1329962 -0.088159 0.0357232 0.0052086 0.0061329 0.0030751 -0.0378651 -0.1142699 0.0072024 -0.1325506 -0.0901819 0.0478854 0.003408 -0.01081 0.0103846 -0.0045336 0.097043 -0.0027458 0.1026696 -0.0598836 0.0467118 0.003252 0.0107403 0.0098736 -0.0036507 -0.097018 0.0021249 -0.1027196 -0.0615618 0.0552877 -0.0064808 -0.0037501 -0.0095648 -0.0056317 -0.0986619 0.0093674 -0.1052319 -0.0621838 0.0523436 -0.0066707 0.0035209 -0.0088233 -0.0091907 0.1003961 -0.0103738 0.1075552 -0.0622591 0.0625738 -0.0083855 0.0172153 0.0712028 0.0606043 -0.0765404 0.0396823 -0.0902381 -0.0067144 0.0624541 -0.0073934 -0.0175097 0.071686 0.0606548 0.0763536 -0.0382904 0.0905094 -0.0051558 0.0643392 0.0118367 0.0004211 -0.0381607 0.0328772 0.0854208 0.0154798 0.1070062 -0.0144494 0.0632049 0.0093494 -0.0010154 -0.0404418 0.0365137 -0.0846662 -0.0141311 -0.1067211 -0.0173267 0.2087058 0.1025989 0.0033089 0.1551608 0.1833857 -0.0073596 0.0045072 -0.007758 0.3908523 0.2639613 0.1061548 -0.0012885 0.136159 0.1786806 0.0023413 -0.0018529 0.0023412 0.4033899 unknown
polarizability: 132.647131|1.8736567|102.8941606|0.0893512|0.2824024|64.6302353 unknown
InChI: InChI=1S/C8H12O5/c9-6(8(12)13)4-2-1-3-5-7(10)11/h10,12H,1-5H2
charge 0 multiplicity 1
25 atoms
O  -5.820967 -0.836258 -0.001331
O  2.923872 1.692047 0.008787
O  -4.900169 1.292952 0.087473
O  5.374979 0.478859 0.020143
O  4.333896 -1.602112 0.03739
C  -0.863679 -0.559783 0.021828
C  0.374907 0.362669 0.023333
C  -2.189061 0.232491 0.027304
C  1.690816 -0.43385 0.019582
C  -3.417483 -0.696426 0.023886
C  2.931313 0.440514 0.016384
C  -4.734142 0.054946 0.04218
C  4.267108 -0.351291 0.024646
H  -0.828596 -1.228365 0.907719
H  -0.831354 -1.221383 -0.869407
H  0.346876 1.032392 -0.857669
H  0.348653 1.026873 0.908604
H  -2.229814 0.893376 0.91399
H  -2.230944 0.901937 -0.853095
H  1.750069 -1.113456 -0.856595
H  1.754812 -1.11673 0.892553
H  -3.405716 -1.375583 0.899518
H  -3.417013 -1.358759 -0.864017
H  -6.66962 -0.315354 0.014304
H  6.207356 -0.069205 0.02739
