program: Gaussian 09
title: 000147124
version: EM64L-G09RevD.01
frameworkgroup: C1[X(C22H27N3O4)]
method: RPBEPBE
basis: SDD
operation: Freq
keyword: #p
keyword: freq=noraman
keyword: PBEPBE/SDD
title: #p freq=noraman PBEPBE/SDD
converged: YES YES NO NO
title: Mulliken charges:
elementType: O O O O N N N C C C C C C C C C C C C C C C C C C C C C C H H H H H H H H H H H H H H H H H H H H H H H H H H H
charge: -0.265901 -0.421449 -0.216804 -0.341145 -0.399734 -0.403642 -0.571124 -0.469817 -0.098251 -0.349214 -0.212117 -0.354791 -0.650760 0.244277 -0.399256 0.498247 0.154767 0.221692 -0.379871 -0.454975 0.254455 -0.233756 -0.226254 -0.241264 -0.344096 -0.340239 -0.223429 -0.239040 -0.225947 0.234507 0.221959 0.279052 0.191839 0.219719 0.286609 0.179874 0.223587 0.248629 0.256019 0.371745 0.178091 0.213215 0.327007 0.233909 0.238668 0.272319 0.258177 0.228161 0.227107 0.380169 0.230632 0.278263 0.209445 0.234840 0.231450 0.234448
chargesum: 0.00000
title: Mulliken charges with hydrogens summed into heavy atoms:
elementType: O O O O N N N C C C C C C C C C C C C C C C C C C C C C C
charge: -0.265901 -0.041281 -0.216804 -0.341145 -0.027989 -0.076635 -0.040628 -0.013351 0.180801 0.062345 0.074491 0.048669 -0.146113 0.244277 -0.007950 0.498247 0.154767 0.221692 -0.145962 -0.216307 0.254455 -0.005596 0.000853 -0.010632 -0.065834 -0.130794 0.011411 -0.007590 0.008502
polarizability: 2.78575511e+02 -1.90963122e+01 2.99213216e+02 1.54407187e+01 -1.47832674e+00 2.20047094e+02
1716.lowfreq: -11.1791 -9.6432 -9.0067 -5.1117 0.0002 0.0006 0.0009 5.2341 10.1852
frequency: -10.0309 -2.9465 9.1548 11.3646 18.2400 30.1288 34.8163 42.2552 48.7552 55.9532 65.0573 73.7321 90.9520 95.2099 123.1297 127.6335 131.7028 143.8342 177.4060 181.0259 210.8240 224.1480 241.1809 256.5937 269.9880 287.7183 307.0706 330.5850 351.6881 386.0444 399.5715 402.7658 404.7603 423.0937 440.1454 462.7625 490.6634 495.9292 523.6379 546.7141 555.3517 582.0687 601.5138 614.3732 616.6682 625.3728 652.6195 672.2564 684.2509 689.5332 699.3514 705.8371 742.1747 747.6559 754.8027 775.2610 789.0446 793.8470 826.5401 844.1955 851.6513 854.9362 856.2075 867.0944 898.0819 923.4017 934.1268 935.5464 965.5907 976.0826 985.2738 985.4533 989.4150 989.8206 995.8995 1007.9287 1021.9434 1024.6448 1026.9001 1035.5646 1045.8049 1067.6389 1076.4860 1085.5646 1089.7275 1094.3070 1115.8100 1118.9085 1138.3876 1162.5931 1172.7964 1174.0342 1185.7840 1191.0251 1192.9480 1205.2095 1215.6043 1240.5035 1243.5115 1254.8154 1269.7221 1278.0504 1285.7494 1289.4205 1290.9774 1306.5201 1315.7668 1321.3091 1326.9541 1333.1765 1344.5614 1351.4810 1358.8747 1381.4835 1385.6356 1388.8674 1431.4127 1439.9416 1457.8098 1462.7749 1463.9474 1469.4863 1479.7259 1483.8414 1492.2137 1497.6488 1519.3306 1550.7967 1591.8224 1597.5761 1611.6005 1614.0611 1626.4826 1637.7882 1674.2305 2861.7094 2958.1011 2967.8552 2984.4612 2995.6691 3008.1827 3014.0768 3016.0047 3019.0764 3044.4350 3064.3250 3069.1502 3110.5931 3116.2640 3121.4153 3132.2788 3133.8890 3144.5960 3147.3712 3160.5365 3163.3928 3171.7054 3314.0809 3451.9409 3519.9665 3535.7378 3579.6633
redmass: 3.9551 4.6347 3.9578 4.9264 4.9285 4.9938 1.9678 7.7266 5.0918 6.9180 6.1015 6.1774 4.5837 5.0874 3.1047 2.2574 3.9167 4.5595 3.4145 4.8001 4.1774 1.8049 2.9263 3.4169 5.4619 5.7100 5.7718 2.4106 3.5117 4.6130 2.9565 2.8145 3.8596 4.2661 4.1597 3.5186 4.7551 3.3209 1.3496 3.2616 4.4516 1.4080 1.2938 6.3754 6.2841 3.8483 5.6667 5.1642 4.6308 3.7425 1.5510 1.8790 1.0996 1.8368 1.4509 2.7831 1.2472 2.4511 3.6478 4.5262 1.2854 1.3205 2.7890 2.2075 1.8252 1.5199 2.3882 1.7013 2.1124 1.3974 1.4019 2.0114 5.8100 5.7897 1.3307 1.3425 2.7346 2.4555 2.4062 2.5078 2.5001 2.2221 2.5675 1.6534 2.4261 2.2791 2.0344 2.4972 2.6476 1.7426 1.0621 1.0604 1.3407 1.3022 1.1480 1.5037 2.3932 1.7181 1.3657 1.4157 1.4894 1.4900 1.3286 1.4272 1.2490 1.2118 1.3564 1.4328 1.3488 1.3495 1.4843 1.5230 1.5176 7.3347 8.8614 1.4461 2.2601 2.1457 1.3540 1.0886 1.0768 1.5571 1.0954 2.2889 1.0944 2.4488 1.9165 4.3690 6.0505 6.2580 6.0067 6.1379 5.8893 1.0946 8.9176 1.0715 1.0641 1.0623 1.0635 1.0834 1.0850 1.0615 1.0823 1.0954 1.1004 1.1017 1.1010 1.0880 1.0874 1.0871 1.0900 1.0873 1.0955 1.0922 1.0959 1.1014 1.1004 1.0837 1.0448 1.0642 1.0775 1.0975
irintensity: 0.0817 0.0740 0.0855 0.1178 0.9695 0.3126 2.8510 3.1594 1.9020 1.2580 2.8210 1.2047 3.1696 4.0656 6.6946 0.6384 5.0461 0.3602 0.3716 5.9409 4.7792 17.5843 26.3708 5.7481 26.5056 9.2720 4.4234 1.2311 4.5401 0.8520 0.9979 0.2621 3.4621 7.4827 3.8981 31.2547 9.3179 35.7847 117.7547 52.8666 8.8101 88.5488 244.2815 0.6342 0.1482 9.5342 3.2833 16.7231 14.3638 22.4391 107.4082 45.8606 13.9831 67.5861 67.4257 65.8602 3.3988 12.5756 14.8636 2.6028 1.4635 0.1833 2.6853 1.5383 0.6072 7.2992 2.4999 5.2428 2.1763 0.1743 0.9080 8.1811 0.7714 0.4347 0.3920 1.5235 118.5597 12.6853 31.9555 43.7319 110.3279 10.3757 10.5642 15.8629 2.0249 5.0323 26.2521 3.3729 4.9568 1.5757 0.1402 0.9136 0.1077 3.9316 4.3397 4.6379 5.5980 20.3142 3.6592 0.6913 11.0199 45.4259 15.6983 23.3715 3.1368 12.6431 1.5244 6.0029 2.9544 17.2642 1.9848 13.5271 4.4826 0.7163 2.6469 16.8496 12.0276 6.1311 140.2464 32.8243 0.1906 69.5872 17.0784 16.3129 5.7822 179.4002 416.6782 36.1054 3.8701 14.8846 6.5706 7.6150 244.4973 40.2577 206.1123 103.6921 23.9405 19.2047 37.6216 6.1037 35.7183 6.3738 4.0196 2.3503 32.6806 74.8626 7.1525 8.8803 8.1277 9.7529 6.8664 2.3214 33.9287 21.7992 14.4674 23.0053 18.8284 255.9331 1.9960 25.0027 35.0913 0.1769
temp: 298.150 k
press: 1.00000 atm
elementType: 8 8 8 8 7 7 7 6 6 6 6 6 6 6 6 6 6 6 6 6 6 6 6 6 6 6 6 6 6 1 1 1 1 1 1 1 1 1 1 1 1 1 1 1 1 1 1 1 1 1 1 1 1 1 1 1
symmnumber: 1
zpe: 1197602.5 jmol-1
zpe.correction: 0.456143 hartree
zpe.thermalcorrener: 0.483871 hartree
zpe.thermalcorrenthalpy: 0.484816 hartree
zpe.thermalcorrgfe: 0.392257 hartree
zpe.sumelectzpe: -1317.588188 hartree
zpe.sumelectthermal: -1317.560459 hartree
zpe.sumelectthermalent: -1317.559515 hartree
zpe.sumelectthermalfe: -1317.652074 hartree
dipole: -0.9575 4.5042 -1.6067
dipole: 4.8771
quadrupole: -148.3549 -162.4160 -172.8859
quadrupole: -8.4729 -3.8696 -10.6911
quadrupole: 12.8640 -1.1971 -11.6670 -8.4729 -3.8696 -10.6911
hfenergy: -1318.0443308 hartree
pointgroup: C01 [X(C22H27N3O4)]
dipole: -1.2124376 -1.4870705 0.0203877 debye
polarizability: 300.5547651|18.5135518|269.6137003|3.2200176|24.5025409|227.6673557 unknown
InChI: InChI=1S/C22H27N3O4/c23-14-8-7-13-18(22(28)29)24-21(27)19(15-16-9-3-1-4-10-16)25-20(26)17-11-5-2-6-12-17/h1-6,9-12,18-19,24-25,28H,7-8,13-15,23H2
charge 0 multiplicity 1
56 atoms
O  1.493271 1.942992 2.239735
O  5.634286 1.828097 1.346266
O  4.192739 3.077311 0.019778
O  0.502474 0.003422 -1.726729
N  2.225343 1.030931 0.223415
N  -0.820974 0.612795 0.074529
N  4.157442 -5.329129 -1.23158
C  4.230699 -0.411248 -0.093645
C  3.575897 0.750896 0.703513
C  3.485128 -1.752957 0.079966
C  -0.08366 1.875201 0.315856
C  4.184512 -2.908758 -0.668728
C  -0.940129 2.848449 1.159485
C  1.282281 1.620144 1.029924
C  3.446929 -4.253921 -0.508812
C  -2.323282 3.100865 0.576033
C  4.444046 2.018341 0.626598
C  -0.509309 -0.229006 -0.970315
C  -2.479734 3.748617 -0.678005
C  -3.488296 2.691858 1.274364
C  -1.391371 -1.424494 -1.199332
C  -3.762927 3.977371 -1.219304
C  -4.776995 2.918878 0.73587
C  -4.917896 3.560941 -0.514664
C  -1.248867 -2.105952 -2.435601
C  -2.328046 -1.906116 -0.246338
C  -2.040627 -3.235926 -2.724504
C  -3.117141 -3.040347 -0.534994
C  -2.979886 -3.70512 -1.775918
H  5.274052 -0.515108 0.256233
H  4.272592 -0.141602 -1.168496
H  3.522536 0.478032 1.774928
H  3.417145 -1.994674 1.161044
H  2.445998 -1.655378 -0.290624
H  0.139009 2.313425 -0.677169
H  5.225493 -3.015527 -0.294473
H  4.257357 -2.681261 -1.749619
H  -0.368936 3.791177 1.238036
H  -1.007516 2.454071 2.189449
H  1.93144 0.752194 -0.729231
H  3.307533 -4.456811 0.582943
H  2.433774 -4.160087 -0.945894
H  -1.694263 0.483932 0.589566
H  -1.591416 4.081204 -1.229844
H  -3.386252 2.213512 2.257353
H  3.629943 -6.203002 -1.319496
H  5.111305 -5.492595 -0.892541
H  -3.86472 4.481876 -2.186761
H  -5.665591 2.601078 1.293055
H  6.185386 2.654984 1.291817
H  -5.914062 3.739933 -0.93427
H  -0.508556 -1.728686 -3.148224
H  -2.434466 -1.43028 0.735979
H  -1.926153 -3.751015 -3.68434
H  -3.832159 -3.408945 0.208425
H  -3.59488 -4.58428 -1.997711
