program: Gaussian 09
title: 000146911
version: EM64L-G09RevD.01
frameworkgroup: C1[X(C10H12N2O2)]
method: RPBEPBE
basis: SDD
operation: Freq
keyword: #p
keyword: freq=noraman
keyword: PBEPBE/SDD
title: #p freq=noraman PBEPBE/SDD
converged: YES YES NO NO
title: Mulliken charges:
elementType: O O N N C C C C C C C C C C H H H H H H H H H H H H
charge: -0.301722 -0.277410 -0.430496 -0.602612 -0.137638 -0.673358 0.173465 0.266246 0.200512 -0.350297 -0.342619 -0.225304 -0.243957 -0.228177 0.265030 0.353242 0.279048 0.196624 0.226885 0.276218 0.217051 0.230269 0.229255 0.230851 0.326316 0.342578
chargesum: 0.00000
title: Mulliken charges with hydrogens summed into heavy atoms:
elementType: O O N N C C C C C C C C C C
charge: -0.301722 -0.277410 -0.077254 0.066281 0.127392 0.029199 0.173465 0.266246 0.200512 -0.074079 -0.125569 0.004965 -0.014702 0.002674
polarizability: 1.83107931e+02 -7.49626270e+00 1.30312652e+02 -3.79765289e+00 6.74082217e+00 6.51142263e+01
1716.lowfreq: -11.8065 -8.0384 0.0006 0.0007 0.0008 5.1690 13.7301 46.7639 59.7102
frequency: 13.1438 46.7518 59.7064 80.6758 93.7366 179.1895 214.4140 217.2514 234.0827 293.7711 320.2185 369.1576 400.3130 439.9678 450.4376 516.1676 524.8570 569.2393 601.9580 614.4003 640.7525 662.1426 687.6768 702.4969 711.2092 777.4850 795.7879 853.3225 871.7816 916.6730 935.8933 985.5981 989.4269 1007.9867 1024.2712 1036.8436 1064.5006 1078.6470 1086.4668 1104.8591 1171.9422 1182.2971 1195.5709 1224.8547 1280.4719 1318.4407 1323.2114 1365.4868 1385.3050 1395.2787 1431.9102 1453.7494 1471.8337 1484.8555 1500.3069 1557.7684 1593.2673 1603.1943 1611.7315 1645.4896 2990.5237 2991.5009 3089.6341 3113.5978 3121.7107 3131.0701 3144.5061 3157.8206 3168.7527 3479.7623 3521.8903 3673.9266
redmass: 4.0075 4.4854 4.6845 5.4228 5.4121 4.6516 3.1854 4.2551 1.2012 3.4701 6.7834 3.3645 2.7984 4.8172 3.8021 1.5686 1.8417 1.7268 2.3515 6.3242 1.3929 3.9278 4.2301 1.5534 2.9700 3.2744 2.4416 1.2613 3.6158 2.1043 1.4452 1.3792 6.1041 1.3386 2.4074 1.6378 1.9375 2.0539 2.0051 2.1966 1.0672 2.2112 1.3492 1.3948 2.0491 1.3309 1.3968 1.9038 9.0110 1.5986 2.2105 1.3774 1.5676 1.0524 2.2728 8.0532 1.8898 3.9954 6.0197 2.8599 1.0825 1.0364 1.0992 1.1015 1.0864 1.0875 1.0924 1.0956 1.1006 1.0770 1.0450 1.1043
irintensity: 0.0309 7.1304 4.8989 6.5890 7.0044 0.9868 4.0947 25.8422 0.5128 0.2636 1.9019 0.9146 0.1598 0.3512 6.0206 75.8008 45.3254 124.1734 51.5298 0.7267 38.1005 17.4990 20.6310 109.0452 73.6967 1.2783 21.1832 0.0066 23.1183 17.8851 4.3801 0.4269 0.4524 1.2404 4.9962 5.5812 4.7179 4.6996 11.0388 30.3016 0.5986 2.1781 8.8203 18.4086 11.8732 32.0583 13.2380 158.0749 2.2314 83.7903 10.5592 238.8788 80.0862 13.7983 229.4528 159.8667 65.1271 32.8633 7.5768 237.0800 18.3168 34.9990 37.9284 7.2286 7.4491 3.3919 24.6858 15.8211 22.7006 95.8683 44.8935 30.9762
temp: 298.150 k
press: 1.00000 atm
elementType: 8 8 7 7 6 6 6 6 6 6 6 6 6 6 1 1 1 1 1 1 1 1 1 1 1 1
symmnumber: 1
zpe: 544031.2 jmol-1
zpe.correction: 0.207211 hartree
zpe.thermalcorrener: 0.220673 hartree
zpe.thermalcorrenthalpy: 0.221617 hartree
zpe.thermalcorrgfe: 0.165056 hartree
zpe.sumelectzpe: -647.225758 hartree
zpe.sumelectthermal: -647.212295 hartree
zpe.sumelectthermalent: -647.211351 hartree
zpe.sumelectthermalfe: -647.267913 hartree
dipole: 2.8934 0.6265 0.0147
dipole: 2.9605
quadrupole: -47.8132 -88.9280 -85.8015
quadrupole: -7.1609 -5.2175 -1.8188
quadrupole: 26.3677 -14.7471 -11.6206 -7.1609 -5.2175 -1.8188
hfenergy: -647.4329683 hartree
pointgroup: C01 [X(C10H12N2O2)]
dipole: -1.1413155 0.2275424 0.0475409 debye
dipolederiv: -0.8246159 -0.1617845 0.0050355 0.0915076 -0.9143351 0.1070222 -0.0520829 0.0814388 -0.390554 -0.8590216 -0.0091371 0.0997856 -0.2493833 -0.9060865 0.0462976 0.1421543 0.0354043 -0.3723169 -1.3502195 0.1550766 -0.1012311 0.5183465 -0.5586453 -0.0253061 -0.145887 -0.0178246 -0.4550591 -1.2345582 -0.1901946 0.1553432 -0.0480548 -0.2683386 -0.0050281 0.1813944 0.0248125 -0.7265891 0.5630243 0.1101853 0.0976951 0.3371168 -0.0626883 -0.0696735 0.0483726 -0.0215219 0.3185485 -0.1293864 0.086823 -0.0201973 0.0146716 -0.0089378 -0.0561286 -0.0433002 -0.0493013 -0.005775 1.8628848 0.047637 0.060195 -0.2919866 1.0687871 -0.1854195 0.105244 -0.1268053 0.2412885 -0.3633063 -0.101281 0.0126692 -0.1689267 -0.1035731 0.0154098 0.041427 0.020386 -0.003698 1.5454638 0.122791 -0.4029939 0.1845619 1.0379002 -0.029671 -0.4275029 -0.0843726 0.2723838 -0.0478678 0.0834236 -0.0055591 -0.0696299 0.0359438 0.0039229 0.0098876 -0.0101132 -0.1153841 0.0299406 -0.0628418 -0.0216774 0.0225887 -0.0089275 0.0052608 -0.0433151 0.0018078 -0.1413745 0.0630029 -0.1513361 -0.0126758 -0.1531356 -0.0275541 0.0071557 -0.0126947 0.008527 -0.1563947 -0.1870537 0.0132828 0.0003696 0.0734504 0.1384292 0.0015805 -0.0017075 0.0027675 -0.149707 0.086147 0.0547064 -0.0157898 0.0111673 -0.0062968 -0.0015712 -0.0137479 -0.0022893 -0.1502919 -0.013303 0.0069836 0.0071518 -0.0913265 0.03396 0.0701478 0.0523698 0.0410678 -0.0594631 0.3869279 -0.0392231 -0.0288155 -0.2391315 0.1998817 0.037415 0.0035515 0.0224268 0.2962247 0.093196 0.1008821 0.0406141 0.095917 0.0016101 -0.0415276 0.0645435 -0.0225915 0.0834057 -0.1953788 -0.108358 0.0085558 -0.1261005 0.0742508 -0.0075964 0.020665 0.0216833 0.0535939 0.1093948 -0.02585 -0.0007366 0.0050634 0.0047136 0.1231355 -0.0224263 0.0551745 -0.0570158 0.1582977 -0.0320743 0.0008968 0.0058305 -0.0087518 -0.0039298 -0.0107569 0.0019536 0.1538187 -0.0427585 0.1053265 0.0139115 0.1153004 0.039776 -0.0081323 0.0212668 -0.0042341 0.1449632 -0.066877 0.0916405 0.0113541 0.1087747 0.0095152 -0.006534 0.0129714 -0.0060515 0.1562322 0.0688729 -0.0249286 0.0048061 -0.0525585 -0.1200436 -0.0015444 0.0063 -0.0031184 0.158292 -0.1062206 -0.0771537 0.0139331 -0.0802395 0.0618794 0.0031105 0.0136819 0.0040824 0.1586623 0.2520393 -0.0019916 0.0296806 -0.0014693 0.1275973 0.0112347 0.0091265 0.0133453 0.3757009 0.2013752 0.0073961 0.0476794 -0.0123543 0.1599338 0.0103693 0.0404652 0.0133461 0.3705088 unknown
polarizability: 182.6492787|8.7026381|131.2596221|-5.6482198|0.3477292|64.6259092 unknown
InChI: InChI=1S/C10H12N2O2/c1-7(9(11)13)12-10(14)8-5-3-2-4-6-8/h2-7,12H,11H2,1H3
charge 0 multiplicity 1
26 atoms
O  -0.00887 -2.109289 0.261143
O  -2.816023 1.87317 0.137497
N  -0.967698 -0.027802 -0.061811
N  -4.539568 0.410151 0.660555
C  -2.333589 -0.541061 0.056549
C  -2.769989 -1.338289 -1.204714
C  0.128793 -0.852303 0.078017
C  1.49039 -0.206496 0.000477
C  -3.241882 0.686842 0.292425
C  2.611877 -1.072889 -0.059183
C  1.701368 1.197958 0.000936
C  3.919213 -0.549602 -0.130264
C  3.010944 1.721664 -0.067931
C  4.123073 0.850635 -0.137272
H  -2.379027 -1.22319 0.929164
H  -0.902705 0.988215 -0.19021
H  -2.057171 -2.164532 -1.357669
H  -3.781461 -1.767906 -1.083835
H  -2.768093 -0.686606 -2.09541
H  2.424591 -2.151561 -0.042753
H  0.86238 1.899972 0.074432
H  4.777381 -1.228941 -0.178635
H  3.163253 2.806529 -0.062489
H  5.138172 1.259747 -0.191214
H  -4.871549 -0.542692 0.79789
H  -5.18421 1.187279 0.803804
