program: Gaussian 09
title: 000146912
version: EM64L-G09RevD.01
frameworkgroup: C1[X(C13H9F3N2O3)]
method: RPBEPBE
basis: SDD
operation: Freq
keyword: #p
keyword: freq=noraman
keyword: PBEPBE/SDD
title: #p freq=noraman PBEPBE/SDD
converged: YES YES NO NO
title: Mulliken charges:
elementType: F F F O O O N N C C C C C C C C C C C C C H H H H H H H H H
charge: -0.163092 -0.168160 -0.169244 -0.320065 -0.211042 -0.212285 -0.677942 0.022456 0.201139 0.342537 0.324650 -0.479100 -0.309306 -0.413355 0.354444 0.248677 -0.312673 -0.356689 0.382072 -0.346184 -0.331825 0.258694 0.271149 0.269825 0.282542 0.269753 0.290504 0.292050 0.319824 0.340644
chargesum: 0.00000
title: Mulliken charges with hydrogens summed into heavy atoms:
elementType: F F F O O O N N C C C C C C C C C C C C C
charge: -0.163092 -0.168160 -0.169244 -0.320065 -0.211042 -0.212285 -0.017473 0.022456 0.201139 0.342537 0.324650 -0.220405 -0.038157 -0.143530 0.354444 0.248677 -0.030131 -0.086936 0.382072 -0.055680 -0.039775
polarizability: 3.01049496e+02 1.05165177e+01 1.62883548e+02 1.00980436e+01 -1.20813222e+00 1.04354449e+02
1716.lowfreq: -17.8991 -2.0850 0.0004 0.0006 0.0011 4.0981 8.0685 20.3349 31.7424
frequency: -17.8632 20.3161 31.6537 38.7161 74.4250 99.0003 104.9813 156.5972 170.8590 180.2272 231.9906 262.1390 269.3506 306.6991 328.1758 354.5889 357.1702 404.2767 415.8720 419.0710 435.9385 468.5004 481.3790 489.1535 495.2066 505.5566 538.7114 540.7431 598.2052 617.0204 628.0524 646.8855 663.0007 678.6125 715.1327 725.2823 749.1295 783.1897 812.4538 834.5288 837.8997 859.1647 861.1228 899.2665 941.7881 979.6234 982.9728 990.9822 996.8710 1011.1451 1012.4362 1080.3917 1095.2167 1108.3988 1127.7361 1161.8546 1174.1095 1212.7593 1223.4656 1250.5597 1279.8358 1289.8399 1331.7805 1359.1167 1402.7044 1414.3863 1429.1499 1452.1472 1471.3723 1509.9955 1592.6775 1595.8728 1610.1045 1614.8057 1642.3791 3149.4095 3158.3622 3168.2484 3169.6690 3186.6934 3189.3260 3190.7306 3563.4977 3707.6494
redmass: 12.5930 6.8218 8.5436 7.4511 6.4091 8.9237 8.2463 8.8188 6.3320 6.8786 5.5956 6.6248 6.8862 7.5566 9.5453 6.5985 6.2884 2.5970 1.8928 2.6796 3.3031 4.3120 3.3504 3.4450 1.5120 7.3943 5.6968 6.5403 9.1232 8.4915 7.5140 5.4197 5.0024 8.3856 4.6128 5.0143 5.4525 7.8387 1.4056 1.4321 3.5075 1.6187 1.6157 7.1078 1.3373 10.6846 1.3228 1.3448 2.9164 2.0336 6.0528 2.2991 3.2391 1.2486 2.1394 1.4345 1.8326 3.5768 6.9598 2.5486 1.4362 1.2975 2.8720 8.1681 9.6311 9.7111 4.2075 4.5204 2.4409 3.5965 7.8186 5.8558 4.5642 1.8532 2.8129 1.0924 1.0901 1.0890 1.0896 1.0962 1.0957 1.0972 1.0448 1.1045
irintensity: 0.4196 0.6416 0.7741 1.0246 0.1054 1.2945 0.3430 2.5592 1.1177 1.4089 7.7926 8.2252 1.5355 11.5872 2.6025 4.9925 22.2614 51.0101 65.1004 19.2458 4.9468 20.7859 39.4529 12.0763 83.1350 2.7736 5.2104 0.6339 16.1017 10.2810 5.3351 2.7649 17.4073 1.7062 1.3395 13.5137 3.6506 5.0440 52.7700 25.6860 58.6720 68.3176 46.3670 53.3279 4.4931 216.1805 4.2598 0.6767 3.0726 42.0677 253.2939 62.8081 16.2026 24.0758 152.9699 186.2741 210.8759 778.1543 181.3050 85.9787 0.9241 0.6490 163.9988 96.4075 11.7660 27.1132 17.2492 89.2446 100.3040 85.7144 36.3522 165.6034 90.2135 36.1238 241.5606 3.6807 4.3202 0.5917 0.8314 0.9977 0.5465 4.2177 88.7939 43.0038
temp: 298.150 k
press: 1.00000 atm
elementType: 9 9 9 8 8 8 7 7 6 6 6 6 6 6 6 6 6 6 6 6 6 1 1 1 1 1 1 1 1 1
symmnumber: 1
zpe: 531861.6 jmol-1
zpe.correction: 0.202575 hartree
zpe.thermalcorrener: 0.219963 hartree
zpe.thermalcorrenthalpy: 0.220907 hartree
zpe.thermalcorrgfe: 0.155468 hartree
zpe.sumelectzpe: -1133.916228 hartree
zpe.sumelectthermal: -1133.898840 hartree
zpe.sumelectthermalent: -1133.897896 hartree
zpe.sumelectthermalfe: -1133.963335 hartree
dipole: 1.6523 4.5726 0.2196
dipole: 4.8669
quadrupole: -181.0932 -109.4720 -117.4790
quadrupole: -3.4944 7.1058 7.3036
quadrupole: -45.0784 26.5427 18.5357 -3.4944 7.1058 7.3036
hfenergy: -1134.118803 hartree
pointgroup: C01 [X(C13H9F3N2O3)]
dipole: -0.6580264 -1.7944064 0.116439 debye
polarizability: 300.846823|9.6756959|162.7983109|-12.8452888|0.4412871|104.64236 unknown
InChI: InChI=1S/C13H9F3N2O3/c14-13(15,16)8-1-6-12(11(17)7-8)21-10-4-2-9(3-5-10)18(19)20/h1-7H,17H2
charge 0 multiplicity 1
30 atoms
F  -4.982415 2.057569 -0.605802
F  -5.823384 -0.036193 -0.363688
F  -5.142955 1.120732 1.454985
O  0.368476 -1.519752 -0.400773
O  5.560245 2.013411 0.823665
O  6.474606 0.263662 -0.323053
N  -1.524086 -2.724796 1.131261
N  5.466444 0.89212 0.187025
C  -0.878289 -0.839686 -0.267867
C  -3.427822 0.271199 -0.049455
C  -1.85681 -1.532654 0.51048
C  -3.145418 -0.945237 0.610135
C  -1.168775 0.356834 -0.941842
C  -2.453401 0.930971 -0.832161
C  1.593669 -0.840503 -0.255014
C  -4.805839 0.847508 0.09747
C  1.730003 0.382444 0.449191
C  2.718494 -1.498692 -0.809737
C  4.125583 0.291039 0.034099
C  3.008238 0.949934 0.594737
C  3.994724 -0.931418 -0.665252
H  -3.920766 -1.441274 1.203769
H  -0.400791 0.83538 -1.557091
H  -2.692364 1.862752 -1.34909
H  0.856135 0.872375 0.886585
H  2.571314 -2.439828 -1.346443
H  3.155964 1.887045 1.13768
H  4.884838 -1.408716 -1.082493
H  -2.20596 -3.237401 1.681832
H  -0.598254 -3.120226 0.989847
