program: Gaussian 09
title: 000146902
version: EM64L-G09RevD.01
frameworkgroup: C1[X(C14H13N)]
method: RPBEPBE
basis: SDD
operation: Freq
keyword: #pfreq=noraman
keyword: PBEPBE/SDD
title: #p freq=noraman PBEPBE/SDD
converged: NO NO NO NO
title: Mulliken charges:
elementType: N C C C C C C C C C C C C C C H H H H H H H H H H H H H
charge: -0.240029 0.064463 0.242517 0.158718 0.212733 0.376363 -0.394728 -0.355537 -0.375530 -0.646850 -0.472277 -0.215990 -0.845178 -0.280899 -0.224706 0.232243 0.238374 0.231098 0.239940 0.236546 0.235696 0.225959 0.219540 0.232435 0.230398 0.232382 0.221414 0.220906
chargesum: 0.00000
title: Mulliken charges with hydrogens summed into heavy atoms:
elementType: N C C C C C C C C C C C C C C
charge: -0.240029 0.064463 0.242517 0.158718 0.212733 0.376363 -0.162485 -0.117163 -0.144432 0.065333 -0.246319 0.003550 -0.149964 -0.059485 -0.003800
polarizability: 2.39114724e+02 8.86924592e+00 1.77145220e+02 -1.50660950e-01 1.00107699e+00 7.04438321e+01
1716.lowfreq: -0.0007 -0.0005 -0.0003 0.4385 9.5507 12.8808 51.0628 93.3858 116.6319
frequency: 50.7409 93.3842 116.6272 129.0169 194.2549 199.8984 222.0978 271.5568 304.3952 317.6498 323.4409 413.6440 437.7370 520.1601 521.4320 540.5045 563.0233 579.4231 582.4623 608.0929 668.6919 728.4872 752.6959 763.3068 768.1004 787.7530 802.0023 849.7324 873.2214 926.6014 931.5238 957.5846 971.1130 988.0118 1003.6494 1022.8897 1044.0310 1083.7526 1097.7109 1116.1099 1132.5964 1156.7492 1168.3838 1182.1463 1231.8084 1265.0938 1297.7189 1330.2003 1349.7010 1395.4224 1399.9503 1403.5486 1425.5305 1442.8084 1466.4262 1469.6101 1472.4764 1477.3140 1482.4146 1491.4852 1498.8322 1582.1609 1593.8691 1605.3375 1630.7419 2969.0889 2975.4463 3045.1869 3064.7620 3081.4715 3098.1639 3122.5061 3125.2655 3138.6965 3139.4238 3154.2704 3157.6206 3170.3726
redmass: 1.0677 3.3431 3.9235 3.0420 3.7897 1.2749 2.1547 2.5126 4.4176 4.9596 3.1828 6.1266 2.9681 3.4904 4.1944 5.6661 5.4232 3.6546 3.7225 5.0477 5.6590 2.0119 1.4666 4.7337 1.8444 3.4142 4.2799 1.5207 1.3571 2.7244 1.3911 1.3261 1.3050 7.3629 2.0023 2.0486 1.5509 1.6602 2.2882 1.3145 1.5445 1.9077 1.1069 1.3571 2.1893 1.8948 2.3098 2.3466 2.8226 1.7174 2.3821 3.5375 1.8973 2.1921 2.0471 1.7140 1.0461 1.0890 1.2891 1.7719 2.3491 6.6757 7.7031 6.9094 7.5794 1.0373 1.0379 1.0975 1.0963 1.0981 1.1007 1.0857 1.0850 1.0913 1.0900 1.0956 1.0988 1.0977
irintensity: 0.0795 0.5417 5.0860 1.4539 0.1910 3.0850 0.5228 0.9996 1.0313 0.1727 0.7231 0.3146 3.3437 2.3563 2.0202 1.7087 8.7761 0.2664 0.4330 1.6176 1.7330 68.9239 39.8839 2.9817 46.0709 24.9903 0.6075 0.1325 0.0903 8.2156 1.4859 0.5817 0.0286 8.1995 2.9248 12.1198 8.1704 14.0071 16.5557 6.3405 4.8767 5.5936 11.3637 0.6388 3.7012 12.9743 12.0155 58.1325 19.3607 14.0720 7.8746 23.7078 15.8844 9.3005 10.3060 42.7114 14.4888 30.9443 13.0501 46.7403 32.6304 1.3522 17.5559 41.0853 11.9329 30.3866 75.2057 19.6109 25.6125 28.5624 10.5705 3.7133 0.6284 20.3175 18.4669 35.8087 31.4151 22.0915
temp: 298.150 k
press: 1.00000 atm
elementType: 7 6 6 6 6 6 6 6 6 6 6 6 6 6 6 1 1 1 1 1 1 1 1 1 1 1 1 1
symmnumber: 1
zpe: 600053.5 jmol-1
zpe.correction: 0.228548 hartree
zpe.thermalcorrener: 0.240930 hartree
zpe.thermalcorrenthalpy: 0.241874 hartree
zpe.thermalcorrgfe: 0.190122 hartree
zpe.sumelectzpe: -595.029010 hartree
zpe.sumelectthermal: -595.016628 hartree
zpe.sumelectthermalent: -595.015684 hartree
zpe.sumelectthermalfe: -595.067436 hartree
dipole: -0.2740 1.6668 0.0024
dipole: 1.6892
quadrupole: -81.6863 -71.6535 -94.8865
quadrupole: -2.4823 0.0107 -0.0671
quadrupole: 1.0558 11.0886 -12.1444 -2.4823 0.0107 -0.0671
hfenergy: -595.257558 hartree
pointgroup: C01 [X(C14H13N1)]
dipole: -0.0793019 0.6598372 0.0014135 debye
polarizability: 239.7658333|6.155607|176.4926866|-0.1134337|1.0780314|70.4452561 unknown
InChI: InChI=1S/C14H13N/c1-10-6-5-9-13-14(10)11-7-3-4-8-12(11)15(13)2/h3-9H,1-2H3
charge 0 multiplicity 1
28 atoms
N  -0.289473 1.65461 -0.010839
C  0.710777 -0.436543 -0.003233
C  0.948385 0.984753 0.000636
C  -0.739027 -0.617224 -0.003539
C  -1.323313 0.701224 0.000417
C  1.811681 -1.337392 -0.003378
C  2.250737 1.530016 0.011632
C  -1.597404 -1.744935 -0.004392
C  -2.721185 0.902478 0.011387
C  -0.47126 3.105172 -0.008265
C  3.11424 -0.782937 0.001859
C  3.330583 0.622308 0.009885
C  1.609781 -2.840887 -0.007875
C  -2.995884 -1.550506 0.000529
C  -3.54981 -0.240739 0.008918
H  2.428384 2.610144 0.027649
H  -1.189214 -2.759549 -0.008037
H  -3.159837 1.905731 0.027438
H  -0.522388 3.512602 1.019674
H  0.366827 3.58604 -0.540045
H  -1.402366 3.363962 -0.539936
H  3.979425 -1.456132 0.003004
H  4.356495 1.008183 0.018196
H  1.045326 -3.169939 -0.901467
H  2.577962 -3.370202 -0.006394
H  1.040038 -3.174635 0.880599
H  -3.664412 -2.418426 0.000967
H  -4.638569 -0.114277 0.01691
