program: Gaussian 09
title: 000147031
version: EM64L-G09RevD.01
frameworkgroup: C1[X(C20H33N3O3S)]
method: RPBEPBE
basis: SDD
operation: Freq
keyword: #p
keyword: freq=noraman
keyword: PBEPBE/SDD
title: #p freq=noraman PBEPBE/SDD
converged: YES YES NO NO
title: Mulliken charges:
elementType: S O O O N N N C C C C C C C C C C C C C C C C C C C C H H H H H H H H H H H H H H H H H H H H H H H H H H H H H H H H H
charge: 1.055260 -0.537088 -0.537793 -0.437350 -0.164134 -0.570975 -0.281670 -0.082218 -0.041195 -0.514559 -0.118472 -0.416766 -0.633659 -0.653348 0.326598 0.296940 -0.314579 -0.426144 -0.541101 -0.381431 0.288885 -0.423183 -0.676906 -0.342728 -0.334014 -0.647935 -0.652632 0.278350 0.213401 0.201473 0.273117 0.259367 0.200451 0.239004 0.219280 0.239616 0.238011 0.224762 0.226494 0.187290 0.335876 0.209419 0.205584 0.260063 0.230181 0.218801 0.211108 0.208046 0.233467 0.211610 0.260472 0.251966 0.219071 0.352377 0.210000 0.243696 0.216013 0.265890 0.220373 0.197570
chargesum: 0.00000
title: Mulliken charges with hydrogens summed into heavy atoms:
elementType: S O O O N N N C C C C C C C C C C C C C C C C C C C C
charge: 1.055260 -0.537088 -0.537793 -0.084973 -0.164134 -0.235100 -0.281670 0.196132 0.172206 -0.039969 0.140895 0.022690 -0.174763 -0.190575 0.326598 0.296940 0.099206 -0.011141 -0.281039 -0.151250 0.288885 -0.204382 -0.024286 0.129354 0.137024 0.021775 0.031200
polarizability: 3.41156073e+02 -1.61907177e+01 2.57838226e+02 1.14359480e+01 1.29412338e+01 2.34612495e+02
1716.lowfreq: -10.6618 -4.4634 -0.0017 -0.0014 -0.0010 3.9761 10.8648 15.8222 22.7522
frequency: 8.5196 15.3369 22.6416 25.8801 35.7244 49.3079 52.6860 53.5725 79.2161 110.1241 120.2348 135.1629 136.6614 156.4351 169.5439 179.7924 191.2859 196.7043 208.2509 213.6446 222.5311 232.6947 240.5746 259.8203 279.6377 284.0882 301.8758 307.7289 327.0178 329.2216 348.4348 349.0614 350.6670 378.0760 385.3892 407.7453 416.7540 433.9871 439.7392 441.1796 472.2127 480.6775 500.1432 513.5781 524.4988 562.4224 568.5638 573.9410 630.0007 679.0751 703.2314 738.0815 755.6377 760.8215 778.3873 783.8339 789.2563 800.7242 810.1966 829.7817 835.6905 837.6729 870.6473 873.7348 894.2321 902.2031 916.3589 921.6618 927.2428 934.2768 940.8071 948.0440 965.2863 988.8772 1013.5575 1023.2514 1052.3262 1056.8247 1059.8598 1081.3432 1090.0116 1093.1221 1097.7512 1098.3639 1101.2403 1114.9125 1123.7625 1141.4627 1146.8208 1153.0207 1161.4861 1172.1006 1178.9493 1184.2752 1192.8623 1206.8846 1217.7144 1225.6696 1238.7464 1255.8617 1264.5906 1269.3251 1271.9187 1276.0061 1278.4655 1286.8628 1299.3498 1310.1687 1314.8971 1326.5032 1336.3865 1344.6794 1346.3260 1353.5476 1355.9957 1360.1050 1365.8544 1367.6632 1377.4597 1387.5354 1390.0222 1393.1819 1395.2159 1448.9686 1452.9353 1455.7484 1456.6615 1459.7711 1464.1637 1470.7906 1471.0185 1471.8675 1475.3170 1477.6899 1481.8340 1484.2881 1489.4000 1491.5993 1499.4867 1595.9410 1633.5997 2817.7279 2848.3404 2870.4790 2931.1577 2946.7957 2955.0358 2956.1705 2964.7441 2977.6991 2979.2113 2984.3719 2988.5784 2989.0327 3021.1412 3024.7720 3026.2199 3026.4188 3045.5642 3048.1595 3053.7608 3054.8462 3072.6668 3078.7168 3081.3745 3082.4151 3085.5682 3105.9104 3107.7447 3110.9811 3131.2687 3147.3420 3296.6068 3582.3572
redmass: 4.2836 3.8163 4.3464 4.0236 3.3067 3.3800 4.1328 3.7727 2.8871 3.1033 2.9051 4.7295 3.0860 2.9344 2.9718 4.5684 1.9412 1.2348 1.5947 2.1944 2.9225 4.1010 2.7034 2.9240 2.6865 1.9715 3.5030 3.6292 3.1176 3.8953 1.3790 2.1062 3.1767 2.9682 2.5071 4.1299 3.3538 3.7310 3.3473 3.8664 4.7775 3.2568 3.2633 3.7331 3.6601 4.1359 3.2594 3.2791 4.8759 2.5345 2.9880 5.6918 2.8736 1.9045 1.5544 1.2616 1.6702 1.9232 5.9825 2.5751 2.4225 1.4238 1.6825 1.9483 1.6078 1.9303 1.4508 1.7570 2.2795 2.9676 1.5624 3.3623 3.1008 1.9530 2.2579 2.0679 2.7838 2.3458 2.7889 2.3751 1.8142 2.6256 2.0376 2.0773 2.0607 2.0125 1.8610 1.7997 1.3478 2.4387 1.4843 1.7930 1.5380 1.5444 1.8112 1.9161 1.3375 1.3471 1.5521 1.8514 1.4433 1.3927 1.3189 1.1401 1.4282 1.1339 1.4884 1.4092 1.3727 1.4527 1.3892 1.4483 1.2612 1.3542 1.4477 1.3828 1.3687 1.3853 1.3240 1.2035 1.2172 1.2691 4.2888 1.6239 1.5179 1.0966 1.0453 1.0480 1.1868 1.0939 1.0748 1.0580 1.0534 1.0499 1.0631 1.0724 1.0809 1.0501 2.6915 6.8768 6.6190 1.0799 1.0717 1.0706 1.0669 1.0671 1.0636 1.0633 1.0682 1.0365 1.0772 1.0607 1.0364 1.0364 1.0973 1.0944 1.0967 1.0970 1.0976 1.0941 1.0869 1.0887 1.0993 1.0892 1.0991 1.0989 1.0984 1.1007 1.0867 1.1009 1.0968 1.0920 1.0730 1.0660
irintensity: 1.3095 0.1435 1.5039 0.7773 0.1700 0.0157 0.2591 0.0673 0.7818 3.8944 1.9553 0.5208 0.8742 0.6569 2.5215 3.1506 1.1159 1.2535 4.1537 2.2754 2.8878 0.6375 0.7210 5.5783 5.0207 0.1800 13.5431 1.8421 0.6884 1.2165 88.3345 48.3553 6.4022 13.1570 1.3909 35.0220 6.2643 30.7228 8.5420 22.9800 14.0708 25.8410 10.5776 12.7201 101.5320 14.8884 8.5319 5.3927 3.1504 18.6028 1.7500 7.0601 3.8255 17.1024 5.7581 2.3126 30.4077 8.6976 116.4373 22.6760 34.3357 25.1740 1.7281 5.1212 5.8764 32.0584 8.7637 5.9470 16.4733 22.4385 13.2211 13.1568 76.9385 9.1019 28.9910 22.1316 5.6247 42.0387 15.2649 5.1779 4.6452 15.0655 4.9060 10.9188 22.3135 49.8375 18.5445 8.0415 87.6409 31.7308 21.8227 2.3510 48.9320 38.1452 13.2157 13.4961 30.2273 2.7803 2.5841 58.1253 21.8973 12.3686 7.5057 3.5856 8.3972 12.3143 4.2936 4.0101 2.8466 11.4288 12.3904 5.1249 7.7354 6.9070 2.2667 11.8431 2.4898 28.5066 4.5260 12.5848 33.5469 22.7292 11.4847 6.7680 1.2501 10.7428 5.4111 6.5834 4.8476 10.1406 10.4368 13.3458 12.3012 10.6031 4.5926 17.8081 21.8499 12.8929 96.5209 20.7908 56.5432 47.1955 96.5559 115.3294 46.0417 17.5802 24.0456 22.7100 12.2787 25.4206 47.9194 41.1086 23.1621 55.2267 17.1574 7.5562 21.6917 13.0941 22.6783 1.3247 35.3681 14.2885 42.2927 42.9400 53.2062 38.0212 26.0480 23.4126 16.7508 14.4630 25.5126 4.3855 119.2137 38.7715
temp: 298.150 k
press: 1.00000 atm
elementType: 16 8 8 8 7 7 7 6 6 6 6 6 6 6 6 6 6 6 6 6 6 6 6 6 6 6 6 1 1 1 1 1 1 1 1 1 1 1 1 1 1 1 1 1 1 1 1 1 1 1 1 1 1 1 1 1 1 1 1 1
symmnumber: 1
zpe: 1329274.0 jmol-1
zpe.correction: 0.506294 hartree
zpe.thermalcorrener: 0.535779 hartree
zpe.thermalcorrenthalpy: 0.536723 hartree
zpe.thermalcorrgfe: 0.442983 hartree
zpe.sumelectzpe: -1567.610019 hartree
zpe.sumelectthermal: -1567.580534 hartree
zpe.sumelectthermalent: -1567.579590 hartree
zpe.sumelectthermalfe: -1567.673330 hartree
dipole: 0.2437 6.7070 1.1844
dipole: 6.8151
quadrupole: -150.6973 -181.8695 -166.2177
quadrupole: -4.0308 3.3865 -1.5631
quadrupole: 15.5642 -15.6079 0.0438 -4.0308 3.3865 -1.5631
hfenergy: -1568.1163131 hartree
pointgroup: C01 [X(C20H33N3O3S1)]
dipole: -0.1153426 -2.5820115 0.7135484 debye
polarizability: 342.4867373|-14.7668953|254.6410327|-1.3445214|-16.2871712|236.4790235 unknown
InChI: InChI=1S/C20H33N3O3S/c1-4-9-22-14-18(21-27(25,26)23(5-2)6-3)11-17-10-16-12-19(24)8-7-15(16)13-20(17)22/h7-8,12,17-18,20-21,24H,4-6,9-11,13-14H2,1-3H3
charge 0 multiplicity 1
60 atoms
S  2.674276 1.498973 0.03015
O  3.041356 2.055475 -1.447299
O  1.640224 2.291824 1.004426
O  -6.675564 2.485552 -0.175175
N  -0.0696 -2.046445 -0.247423
N  2.098264 -0.251412 -0.207726
N  4.278093 1.343129 0.979317
C  -0.917372 0.224103 -0.916989
C  -1.29394 -1.255565 -0.620787
C  0.257219 0.344016 -1.911925
C  1.447952 -0.560448 -1.520321
C  0.934746 -2.008335 -1.344487
C  -2.14919 0.982359 -1.458408
C  -2.354976 -1.283953 0.504471
C  -3.396643 0.799763 -0.606574
C  -3.498004 -0.292746 0.298833
C  -0.372091 -3.439418 0.193042
C  0.84865 -4.24271 0.700542
C  -4.473533 1.706095 -0.738872
C  -4.691387 -0.447387 1.045361
C  -5.651312 1.537012 0.016413
C  -5.769282 0.452341 0.918516
C  1.630873 -3.546481 1.834404
C  4.020384 0.924701 2.39222
C  5.276087 0.523085 0.215236
C  5.136714 1.478088 3.298994
C  6.134008 1.386252 -0.723955
H  -0.619542 0.68806 0.046474
H  -1.746663 -1.687562 -1.554682
H  -0.079666 0.030532 -2.922247
H  0.58961 1.394869 -1.998903
H  2.224784 -0.526592 -2.302837
H  0.508346 -2.356565 -2.318482
H  1.781094 -2.662959 -1.084932
H  -2.361514 0.63001 -2.491046
H  -1.906553 2.058655 -1.545402
H  -1.832178 -1.063906 1.459603
H  -2.791326 -2.294727 0.606869
H  -1.092737 -3.375872 1.025946
H  -0.870422 -4.017469 -0.627966
H  1.427947 -0.466146 0.561935
H  0.458994 -5.215042 1.063034
H  1.535522 -4.489852 -0.132044
H  -4.408585 2.555652 -1.427015
H  -4.78088 -1.289587 1.743008
H  -6.683303 0.311135 1.509952
H  2.431948 -4.203801 2.219947
H  0.962147 -3.292529 2.678101
H  2.096102 -2.60963 1.479978
H  3.949755 -0.181728 2.487996
H  3.054488 1.366409 2.696848
H  4.766994 -0.294757 -0.338249
H  5.913972 0.036578 0.977645
H  -7.447422 2.288534 0.411281
H  6.12914 1.079549 3.021247
H  5.173445 2.577759 3.227118
H  4.938107 1.195031 4.349195
H  5.504194 1.86419 -1.491737
H  6.648223 2.1791 -0.153738
H  6.895626 0.759794 -1.225677
