program: Gaussian 09
title: 000146886
version: EM64L-G09RevD.01
frameworkgroup: C1[X(C6H13NS)]
method: RPBEPBE
basis: SDD
operation: Freq
keyword: #p
keyword: freq=noraman
keyword: PBEPBE/SDD
title: #p freq=noraman PBEPBE/SDD
converged: YES YES NO NO
title: Mulliken charges:
elementType: S N C C C C C C H H H H H H H H H H H H H
charge: 0.151173 -0.311893 -0.426754 0.003618 -0.347609 -0.641948 -0.704461 -0.725231 0.247367 0.237787 0.272610 0.202036 0.227408 0.270560 0.246616 0.200759 0.213415 0.236900 0.204578 0.222523 0.220546
chargesum: 0.00000
title: Mulliken charges with hydrogens summed into heavy atoms:
elementType: S N C C C C C C
charge: 0.151173 -0.039284 -0.179387 0.241405 0.081836 -0.124772 -0.053387 -0.077583
polarizability: 1.07248853e+02 3.89008591e-01 8.77389236e+01 -3.75273504e+00 1.18926017e-01 6.55995510e+01
1716.lowfreq: -14.0231 -0.0026 -0.0018 -0.0007 9.5185 15.4913 66.8151 79.0896 168.9432
frequency: 66.5278 78.9427 168.9416 204.2403 223.8308 254.0743 301.2322 347.6771 354.3685 422.1798 435.4336 507.8958 585.1467 651.6631 729.7127 836.6973 887.5577 915.6037 923.0180 951.2594 955.9132 1013.6849 1020.6010 1106.1044 1128.2540 1143.0354 1146.3907 1176.3922 1193.2194 1199.3924 1267.4589 1272.5399 1305.7757 1329.4759 1351.1727 1370.7892 1390.1192 1399.4398 1447.1395 1464.8172 1472.5518 1473.8828 1479.8114 1492.3553 2887.9963 2891.8366 2965.3265 2970.8093 3010.6676 3029.6050 3049.2102 3058.8067 3068.6728 3071.6485 3076.9085 3126.0708 3479.4667
redmass: 3.1311 2.7262 2.8400 1.0864 1.2095 2.1619 2.4949 2.0844 3.1648 2.4368 2.1426 3.3223 3.5351 3.8005 2.5303 2.2460 1.7888 1.2313 2.1601 1.8986 1.4450 1.5697 1.7978 1.9672 2.2375 2.7594 1.3041 1.5525 1.4677 1.3053 1.2980 1.2381 1.3772 1.4159 1.3306 1.2344 1.2147 1.3428 1.0985 1.0525 1.0868 1.0483 1.0573 1.0501 1.0738 1.0794 1.0362 1.0364 1.0847 1.0850 1.0619 1.0986 1.0980 1.0996 1.0991 1.1101 1.0750
irintensity: 2.5773 0.2838 2.1955 0.0438 0.0648 3.7286 4.3803 16.0470 10.9592 8.7989 66.5689 10.9401 23.2829 3.8788 19.7374 5.0023 5.2882 1.5673 7.3243 7.5854 4.1794 5.5104 6.1096 5.1932 0.3916 25.0089 1.1790 3.6514 0.1870 16.8587 3.7211 31.6867 1.1578 21.0317 4.6778 19.7669 27.9077 22.5377 6.7440 2.6874 4.4055 6.3196 8.4206 22.4325 77.8946 104.8746 34.8963 29.5531 6.3475 19.1585 54.4518 11.0730 79.0525 20.9955 53.4610 19.9324 0.1017
temp: 298.150 k
press: 1.00000 atm
elementType: 16 7 6 6 6 6 6 6 1 1 1 1 1 1 1 1 1 1 1 1 1
symmnumber: 1
zpe: 479303.8 jmol-1
zpe.correction: 0.182557 hartree
zpe.thermalcorrener: 0.192097 hartree
zpe.thermalcorrenthalpy: 0.193041 hartree
zpe.thermalcorrgfe: 0.148043 hartree
zpe.sumelectzpe: -688.571556 hartree
zpe.sumelectthermal: -688.562016 hartree
zpe.sumelectthermalent: -688.561071 hartree
zpe.sumelectthermalfe: -688.606070 hartree
dipole: 0.1617 2.2991 0.7184
dipole: 2.4141
quadrupole: -52.5398 -58.8175 -59.2124
quadrupole: 2.0969 -0.4750 1.9503
quadrupole: 4.3168 -1.9609 -2.3559 2.0969 -0.4750 1.9503
hfenergy: -688.7541129 hartree
pointgroup: C01 [X(C6H13N1S1)]
dipole: -0.1331252 -0.8931803 0.2942854 debye
dipolederiv: -0.3168238 0.0718377 -0.0272527 0.1161386 -0.2025644 0.0211814 -0.0398672 0.0200869 -0.2012165 -0.7248374 -0.0112528 0.0804565 -0.0455621 -0.4367474 -0.1236017 0.0536531 -0.1409352 -0.5298938 0.5537866 -0.0478511 0.0975893 -0.0577712 0.4165571 -0.004489 0.0477503 -0.0335338 0.3995114 0.0506699 -0.0380711 0.0103792 0.066897 0.0626478 0.0054613 -0.0403754 0.0298158 0.0591913 0.4169525 -0.0347544 -0.1394792 -0.1299763 0.120916 0.080484 -0.1214719 -0.0243916 0.38162 0.2733475 0.0635436 0.0500888 0.1560468 -0.0071041 0.1037175 0.1002925 0.0970569 0.132878 -0.0353618 -0.0514835 -0.0034161 -0.0597844 -0.0790321 -0.033536 0.0289066 -0.0180793 0.1015851 -0.067341 0.0768156 0.0126655 0.0114723 -0.0440307 0.0116418 0.0663182 -0.0259863 0.1098378 -0.080755 0.0140941 -0.0735322 0.0059143 -0.0586808 0.018218 -0.0979723 -0.0218049 -0.2151955 0.0464771 0.009731 -0.0666097 0.0004006 0.0302822 0.0071999 -0.0301293 0.0041248 -0.1261126 0.158506 0.021552 -0.0461628 0.0373167 0.0446313 0.0607681 -0.1022647 0.1659641 0.2584829 -0.0821601 0.0010805 0.0560105 0.0667566 0.0471721 -0.0362092 0.1842574 0.0353993 -0.2437432 -0.0328127 -0.0910474 -0.0271296 -0.1611277 -0.0820662 -0.0532862 -0.0370799 -0.0718299 0.0563807 0.0104566 -0.0387907 -0.0294939 -0.0797757 0.0311941 -0.0493432 -0.0802364 -0.0073416 -0.1306155 -0.1379738 0.0710491 0.0285576 0.0356947 0.0517366 -0.0331388 0.0522401 -0.0295693 0.0700683 0.0785126 -0.0169813 -0.0213785 0.0066033 0.0687739 0.0523167 -0.0814268 -0.0145298 -0.1687719 -0.165695 -0.0432812 0.0983865 0.0111628 0.0964764 -0.0174086 0.1212303 0.002505 0.0294228 0.0704476 0.1256386 -0.0267726 0.0987218 -0.0910561 0.0227971 -0.027169 0.024329 0.0832658 0.0916424 0.0110266 -0.0089927 0.0062295 0.0623882 -0.0001373 -0.0657442 0.0697798 -0.1698197 -0.1668058 0.0419114 0.0971942 0.0037156 0.0786834 0.0223178 0.1120884 -0.000703 0.04515 0.0597678 -0.1347667 -0.0611083 -0.0890731 -0.1101773 -0.0549536 -0.0429998 -0.0603569 0.0579749 unknown
polarizability: 107.1474358|-1.0169183|87.7749107|4.0151029|-0.7159606|65.6649808 unknown
InChI: InChI=1S/C6H13NS/c1-5(2)6-7-3-4-8-6/h5-7H,3-4H2,1-2H3
charge 0 multiplicity 1
21 atoms
S  -0.932784 1.571158 0.0383
N  -0.731221 -1.116071 -0.00107
C  0.129521 0.002749 0.425684
C  1.482874 0.0307 -0.315451
C  -2.161358 -0.852904 0.252742
C  -2.439978 0.507044 -0.412859
C  2.33321 1.241647 0.130422
C  2.255668 -1.293481 -0.08438
H  0.299262 0.042931 1.527805
H  1.250689 0.123868 -1.393751
H  -0.397731 -2.033917 0.316185
H  -2.421043 -0.78827 1.337056
H  -2.773032 -1.652302 -0.205107
H  -2.497098 0.415265 -1.507872
H  -3.341397 0.996304 -0.012121
H  2.555898 1.193594 1.214381
H  3.296576 1.259855 -0.411211
H  1.811576 2.194715 -0.072302
H  2.430757 -1.47032 0.995478
H  3.243454 -1.251356 -0.578536
H  1.713458 -2.160912 -0.503092
