program: Gaussian 09
title: 000147261
version: EM64L-G09RevD.01
frameworkgroup: C1[X(C23H25N3O6S)]
method: RPBEPBE
basis: SDD
operation: Freq
keyword: #p
keyword: freq=noraman
keyword: PBEPBE/SDD
title: #p freq=noraman PBEPBE/SDD
converged: YES YES NO NO
title: Mulliken charges:
elementType: S O O O O O O N N N C C C C C C C C C C C C C C C C C C C C C C C H H H H H H H H H H H H H H H H H H H H H H H H H
charge: 0.209112 -0.246778 -0.289201 -0.210665 -0.260225 -0.244707 -0.297821 -0.314433 -0.204208 -0.608527 -0.342135 0.285521 -0.219218 -0.398693 -0.198437 0.125758 0.183662 -0.337087 -0.098337 -0.095240 -0.532679 0.254570 0.146323 -0.800137 0.330291 -0.226558 -0.683958 -0.210345 -0.249292 -0.239880 -0.212247 -0.236620 -0.237291 0.270089 0.261330 0.273102 0.267066 0.251961 0.276316 0.234761 0.246081 0.248128 0.214143 0.214767 0.242921 0.232111 0.261655 0.290294 0.225551 0.332509 0.341141 0.269490 0.259645 0.256186 0.309902 0.229888 0.221331 0.229113
chargesum: 0.00000
title: Mulliken charges with hydrogens summed into heavy atoms:
elementType: S O O O O O O N N N C C C C C C C C C C C C C C C C C C C C C C C
charge: 0.209112 -0.246778 -0.289201 -0.210665 -0.260225 -0.244707 -0.297821 -0.041330 -0.204208 0.065122 -0.072046 0.285521 0.042112 0.120334 0.077879 0.125758 0.183662 0.143755 -0.098337 -0.095240 0.144359 0.254570 0.146323 -0.063450 0.330291 0.289287 -0.154823 -0.210345 0.006894 0.070022 0.017640 -0.015289 -0.008179
polarizability: 4.38708659e+02 3.36415471e+01 3.23488869e+02 2.10210591e+01 -1.79184701e+01 1.96159408e+02
1716.lowfreq: -12.4794 -5.8918 -0.0003 0.0012 0.0012 3.0277 11.4875 13.5924 21.2099
frequency: 8.0718 12.4469 21.2053 29.0843 33.2724 39.0203 44.8471 58.4149 65.0501 70.6855 76.9300 85.4582 91.4905 96.3434 114.4126 122.7427 125.5001 144.0918 161.1641 175.3085 181.6365 200.1237 215.3131 244.3567 258.3326 261.3048 273.5738 284.3927 292.9752 302.0345 318.6050 322.9431 343.1775 355.4614 374.8869 385.2284 391.4066 408.5091 410.3329 430.9922 458.2762 470.3568 476.8389 490.8118 494.6817 502.4379 507.5085 519.8944 548.4827 590.5014 595.1567 608.9750 610.4634 646.5456 676.7661 677.3470 694.2053 700.8543 713.9843 730.6082 738.3129 747.5990 756.9041 777.4928 783.4085 794.3564 796.9713 811.3760 857.9273 887.8675 896.9574 908.7036 924.7712 935.2914 942.0408 950.6057 963.5086 975.9108 982.8047 988.0952 995.0698 998.7944 1013.4950 1015.0590 1020.8520 1039.9438 1046.2530 1060.4424 1065.4524 1068.6529 1069.3367 1074.0248 1076.6745 1077.7413 1092.9843 1111.5776 1118.9438 1128.2870 1146.7079 1167.3163 1169.0857 1171.5930 1183.6159 1185.6109 1201.7278 1213.6944 1218.9009 1232.8846 1235.7192 1244.5292 1284.4530 1289.4431 1294.5388 1302.8457 1304.0374 1312.6137 1322.6320 1338.9308 1350.5905 1369.6796 1372.7893 1385.7959 1392.9334 1414.9023 1421.9987 1432.5589 1447.3570 1457.5368 1458.0048 1465.6146 1466.8272 1467.8705 1469.9881 1475.1322 1476.2756 1515.8777 1546.1432 1553.3298 1583.2072 1585.5583 1590.1434 1598.8298 1693.5999 2952.2354 2986.9912 2988.8845 3012.7910 3013.9177 3029.7878 3031.4766 3034.3979 3064.7460 3089.7526 3091.8129 3101.7657 3109.2439 3110.3858 3117.8310 3120.7454 3132.7090 3147.3236 3158.3360 3164.6734 3165.7838 3177.8220 3324.6417 3558.8685 3713.9634
redmass: 6.0202 6.3463 5.8809 6.1472 5.4386 5.2743 5.1197 4.8541 1.9921 3.0113 2.5632 3.3811 2.5747 4.8817 5.1726 2.7148 5.5286 4.1161 4.3637 3.2532 3.7153 2.6001 3.4378 4.2522 4.7710 4.3835 4.2362 3.4915 3.9973 3.1116 3.6923 4.5252 3.7587 4.4365 4.5575 5.6316 7.3462 3.0404 4.5685 5.7583 4.5922 4.2862 2.1770 2.1381 1.6319 1.4075 7.6125 4.7698 4.8777 5.3269 4.9531 4.4432 6.4542 4.8040 6.7129 5.4251 10.2263 2.2602 5.0249 9.3542 4.0377 3.5043 1.6237 4.4753 3.8240 4.6994 6.1963 3.5932 1.2423 4.6369 2.5460 3.2096 2.0782 1.3826 2.5874 1.7826 2.2008 2.1167 2.3963 2.0878 5.9566 1.3269 2.1592 3.2686 5.2830 1.4913 3.1951 2.1242 2.3287 1.9423 2.2413 2.2102 2.0790 2.2474 3.1160 1.3289 1.7058 1.3034 1.5269 1.1330 1.0550 1.8884 1.1763 2.0497 1.7306 1.3451 1.9196 1.3528 1.8093 1.8688 1.2492 1.7277 1.3822 2.5654 1.3241 1.5037 4.3475 1.8877 1.5163 8.7318 2.2447 2.4523 1.2648 1.1001 2.0782 1.1295 1.1116 1.9936 1.8324 1.3623 1.0594 1.1786 1.1126 1.2974 1.0589 10.3936 10.6010 8.3575 6.1356 5.9477 1.2133 8.9002 7.4674 1.0330 1.0637 1.0390 1.0638 1.0595 1.0812 1.0590 1.1027 1.0968 1.1075 1.1005 1.1043 1.0986 1.0993 1.0988 1.0851 1.0887 1.0937 1.0962 1.0893 1.1010 1.0968 1.0759 1.0448 1.1054
irintensity: 1.1293 0.2062 0.0281 0.1941 3.5946 1.5375 3.0807 3.3958 4.7132 7.2453 1.0689 3.7329 0.8064 1.4814 4.8002 1.5034 5.5780 4.1942 5.6678 0.6445 0.1042 3.8703 2.8140 0.6493 5.5986 0.1699 1.3342 5.2214 4.4475 0.6382 0.7427 15.7805 10.9728 14.3506 16.5326 8.9628 1.1238 0.1795 3.7418 16.4179 5.6024 4.4261 19.2352 194.0753 1.6836 210.6445 3.7851 0.3564 12.4099 14.4982 1.5424 1.8615 2.1030 5.2799 2.5695 6.1610 57.1749 37.1147 25.8022 12.2866 34.1997 27.3456 77.2802 11.4265 17.2098 9.0768 1.3651 7.4207 6.5855 23.6723 30.6348 44.6317 0.4005 8.9359 60.8585 2.3007 61.3016 19.3878 2.4340 2.3969 131.0929 2.6718 19.3945 18.4953 53.6606 1.0009 72.9101 7.8692 20.8518 5.4951 22.0242 90.5227 0.6104 12.1996 41.0727 1.4647 25.3330 15.2486 14.1388 105.0746 0.4403 10.7076 6.1272 11.3149 159.2825 35.6687 127.5320 18.3425 86.8731 42.7723 27.7619 3.5856 6.4113 259.0614 0.2240 15.5003 105.7689 24.7985 20.8391 1.2187 65.7850 12.0822 42.7825 17.8910 17.2676 18.7900 39.6459 173.2287 48.9988 42.8966 5.7175 21.9609 31.0485 30.1740 9.2184 204.2871 529.0083 84.4331 1.0136 3.8177 94.8234 76.0642 292.3995 59.9689 25.4116 21.0001 28.0171 27.4039 4.3072 28.3380 53.5579 14.4723 9.4360 3.1516 4.5362 19.9431 4.2786 23.8179 8.2655 21.7742 23.2379 1.0050 9.7884 44.5981 22.5452 5.2148 63.6730 40.2361
temp: 298.150 k
press: 1.00000 atm
elementType: 16 8 8 8 8 8 8 7 7 7 6 6 6 6 6 6 6 6 6 6 6 6 6 6 6 6 6 6 6 6 6 6 6 1 1 1 1 1 1 1 1 1 1 1 1 1 1 1 1 1 1 1 1 1 1 1 1 1
symmnumber: 1
zpe: 1173863.3 jmol-1
zpe.correction: 0.447101 hartree
zpe.thermalcorrener: 0.479506 hartree
zpe.thermalcorrenthalpy: 0.480450 hartree
zpe.thermalcorrgfe: 0.378528 hartree
zpe.sumelectzpe: -1902.604611 hartree
zpe.sumelectthermal: -1902.572207 hartree
zpe.sumelectthermalent: -1902.571262 hartree
zpe.sumelectthermalfe: -1902.673184 hartree
dipole: 0.0714 -4.5130 -0.3645
dipole: 4.5283
quadrupole: -175.6829 -190.0512 -210.0334
quadrupole: -0.9873 20.4765 -13.9884
quadrupole: 16.2396 1.8713 -18.1110 -0.9873 20.4765 -13.9884
hfenergy: -1903.0517124 hartree
pointgroup: C01 [X(C23H25N3O6S1)]
dipole: -0.1241592 -1.7760125 0.0659855 debye
polarizability: 444.509839|24.0994249|312.4013389|8.3789654|-34.0022339|201.4457584 unknown
InChI: InChI=1S/C23H25N3O6S/c1-12-18(27)17-16(19(28)20(12)31-8-9-33-13-6-4-3-5-7-13)14(11-32-22(24)29)23(30-2)21-15(25-21)10-26(17)23/h3-7,14-15,21,25H,8-11,24H2,1-2H3
charge 0 multiplicity 1
58 atoms
S  -4.364876 2.427657 0.720076
O  3.727783 -1.032377 2.122209
O  0.356035 -2.892496 -0.671537
O  3.308555 3.245246 -0.470287
O  -0.979538 -0.130184 0.275881
O  -1.404447 2.55548 -0.745752
O  -0.37556 -1.596513 -2.512086
N  4.79023 -1.387589 -1.566598
N  3.650854 0.43239 0.278484
N  -1.818388 -3.005092 -1.308883
C  4.573817 -1.701802 -0.098134
C  3.446969 -0.983829 0.665676
C  5.581955 -0.635043 -0.514708
C  5.052148 0.739458 -0.069373
C  1.922555 -1.262128 0.363944
C  2.452522 1.034307 -0.02588
C  1.393788 0.140008 0.061494
C  1.700824 -2.295628 -0.771876
C  2.284456 2.485346 -0.362514
C  0.032194 0.594456 -0.038639
C  3.680835 -2.367979 2.732291
C  0.908026 2.94275 -0.600201
C  -0.147207 2.040398 -0.503806
C  0.683934 4.38657 -0.984138
C  -0.612397 -2.410531 -1.585311
C  -2.499303 1.739409 -1.362868
C  -3.798142 2.4848 -1.095753
C  -5.073147 0.716823 0.768866
C  -6.46806 0.540263 0.601226
C  -4.236017 -0.397131 1.021647
C  -7.029394 -0.755697 0.68155
C  -4.805858 -1.690976 1.097732
C  -6.198523 -1.873706 0.9298
H  4.869619 -2.707214 0.207058
H  6.659887 -0.809447 -0.519705
H  4.027251 -0.80249 -1.964207
H  5.090598 1.520545 -0.845888
H  5.609545 1.096782 0.815861
H  1.449454 -1.672302 1.274867
H  2.393579 -3.146303 -0.657972
H  1.817714 -1.845045 -1.773654
H  3.727254 -2.188774 3.817461
H  4.54387 -2.994031 2.432511
H  2.739458 -2.903988 2.495869
H  0.084957 4.911256 -0.217308
H  0.120728 4.464133 -1.931375
H  1.652705 4.89939 -1.090512
H  -2.496523 0.724042 -0.942974
H  -2.287292 1.699966 -2.450281
H  -1.91983 -3.589076 -0.482607
H  -2.635507 -2.726465 -1.844623
H  -3.688941 3.55829 -1.325589
H  -4.6110 2.063767 -1.711526
H  -7.104055 1.412973 0.419025
H  -3.159011 -0.254429 1.156645
H  -8.109959 -0.888864 0.557354
H  -4.159016 -2.550953 1.307949
H  -6.635308 -2.876522 1.00049
