program: Gaussian 09
title: 000146904
version: EM64L-G09RevD.01
frameworkgroup: C1[X(C11H14BrNO3)]
method: RPBEPBE
basis: SDD
operation: Freq
keyword: #p
keyword: freq=noraman
keyword: PBEPBE/SDD
title: #p freq=noraman PBEPBE/SDD
converged: YES YES NO NO
title: Mulliken charges:
elementType: Br O O O N C C C C C C C C C C C H H H H H H H H H H H H H H
charge: -0.007043 -0.265984 -0.205163 -0.248291 -0.304875 0.320541 0.224454 -0.419845 -0.285050 -0.347967 -0.234180 -0.177150 -0.240193 -0.699762 0.271880 -0.756536 0.204923 0.263876 0.252408 0.248655 0.247619 0.199621 0.215169 0.197561 0.293304 0.218580 0.310608 0.256462 0.256026 0.210354
chargesum: 0.00000
title: Mulliken charges with hydrogens summed into heavy atoms:
elementType: Br O O O N C C C C C C C C C C C
charge: -0.007043 -0.265984 -0.205163 -0.248291 0.005734 0.320541 0.224454 0.048954 -0.032643 -0.099312 -0.234180 0.070469 0.174597 0.009683 0.271880 -0.033694
polarizability: 2.34005159e+02 -1.42300531e+01 1.64487237e+02 -6.80932822e+00 -9.91947355e+00 8.46152310e+01
1716.lowfreq: -9.2521 -3.2342 -0.0006 -0.0005 -0.0003 7.0578 23.7487 31.4564 52.6819
frequency: 23.5378 31.2031 52.6562 61.6748 62.8505 82.7869 98.5462 115.6819 120.3769 134.4068 190.4464 233.9912 236.0615 252.3708 263.3385 314.0455 319.9724 352.4370 373.8782 415.1377 429.3341 471.0053 491.8694 543.9015 570.4335 602.7846 624.8901 640.8029 727.3188 751.2589 806.4580 830.6910 838.5026 861.1468 897.4750 904.1786 910.4100 939.5251 954.5914 976.9264 1023.0102 1026.6861 1036.0081 1076.7351 1115.4432 1127.4128 1135.4388 1170.5215 1198.1340 1231.4425 1241.9933 1258.4597 1270.0355 1336.0704 1361.4981 1373.2783 1381.9901 1405.8204 1407.1657 1419.5075 1448.7553 1462.6225 1463.6668 1466.8898 1467.8449 1483.4368 1497.7953 1580.0304 1596.8165 1631.5099 2957.1859 2994.4261 2997.2702 3004.4586 3020.5414 3090.9463 3098.1201 3104.2968 3105.5242 3111.6058 3154.6969 3155.1903 3174.8388 3515.9737
redmass: 6.4431 5.9534 4.8701 3.4702 3.7499 2.2854 1.7806 2.8780 2.8914 3.8503 3.8589 4.8801 4.9550 1.2177 7.3175 3.5832 4.0154 4.7572 3.7457 1.2600 3.9675 3.4295 3.6982 4.1238 5.0357 2.6740 7.0306 5.6333 4.2847 4.2967 1.4355 1.1639 5.1315 2.8730 3.4521 2.2572 2.9038 1.3575 2.8927 1.7418 2.9294 2.7897 1.6259 2.0151 2.1893 1.8425 1.4323 1.0786 2.0162 2.4095 3.4936 1.1762 1.2758 1.3598 1.3689 4.2335 1.2669 1.5505 2.4558 1.4789 1.0470 1.0447 1.1785 1.6673 1.0899 1.3425 1.0723 8.1259 6.9699 7.9662 1.0559 1.0365 1.0357 1.0626 1.1070 1.0992 1.1001 1.0989 1.1032 1.1015 1.0900 1.0905 1.0968 1.0800
irintensity: 2.5565 1.8281 4.9416 12.1326 5.1441 1.7515 1.4442 0.1647 1.9651 1.8885 1.9875 2.3600 1.0946 1.0680 6.2305 1.4904 1.4603 0.3922 4.6769 104.2094 14.5224 14.8493 0.5069 6.9235 4.1136 3.5749 28.7366 30.0677 10.5416 1.9161 44.3041 1.8973 35.1463 48.2632 6.1697 7.3294 3.2296 0.0906 32.5617 1.7147 10.0233 59.8529 11.5623 11.8744 14.8739 62.2832 5.4645 8.8709 53.3050 68.9174 209.8649 1.4451 11.7846 18.3008 1.1573 33.7078 74.6695 59.6659 2.7474 73.5955 15.2828 10.6913 18.8182 125.1131 24.9114 17.5103 15.8169 4.1791 7.8423 194.9649 49.2143 36.4825 11.6297 47.0169 36.9668 34.1389 18.9676 8.7907 4.2596 9.6082 6.8088 2.3772 6.8098 15.5985
temp: 298.150 k
press: 1.00000 atm
elementType: 35 8 8 8 7 6 6 6 6 6 6 6 6 6 6 6 1 1 1 1 1 1 1 1 1 1 1 1 1 1
symmnumber: 1
zpe: 608241.3 jmol-1
zpe.correction: 0.231667 hartree
zpe.thermalcorrener: 0.249348 hartree
zpe.thermalcorrenthalpy: 0.250292 hartree
zpe.thermalcorrgfe: 0.182942 hartree
zpe.sumelectzpe: -720.183930 hartree
zpe.sumelectthermal: -720.166249 hartree
zpe.sumelectthermalent: -720.165305 hartree
zpe.sumelectthermalfe: -720.232655 hartree
dipole: -2.1485 -0.9692 0.8316
dipole: 2.4993
quadrupole: -105.6485 -79.9416 -105.7602
quadrupole: 14.5657 -2.2885 -4.7813
quadrupole: -8.5317 17.1752 -8.6434 14.5657 -2.2885 -4.7813
hfenergy: -720.4155966 hartree
pointgroup: C01 [X(C11H14Br1N1O3)]
dipole: 0.8927092 -0.089464 -0.4024681 debye
polarizability: 219.6029713|32.7438477|174.2917002|-14.5061079|16.4549509|89.2129553 unknown
InChI: InChI=1S/C11H14BrNO3/c1-3-15-11-5-4-10(12)6-9(11)7-16-13-8(2)14/h4-6,13H,3,7H2,1-2H3
charge 0 multiplicity 1
30 atoms
Br -4.668399 -2.352831 0.112473
O  -0.050227 1.70923 -0.313349
O  1.185016 -1.44216 0.027374
O  3.244772 0.527147 0.146317
N  2.561938 -1.664477 -0.314979
C  -0.921526 -0.481489 -0.644613
C  -1.123886 0.842549 -0.14901
C  0.427576 -0.883316 -1.172683
C  -1.979784 -1.413701 -0.565161
C  -2.359938 1.203527 0.441974
C  -3.209788 -1.037534 0.010781
C  -3.407878 0.259149 0.522447
C  0.018488 2.947207 0.495856
C  1.421304 3.511314 0.285054
C  3.521136 -0.672291 -0.131073
C  4.951672 -1.17669 -0.334642
H  0.361301 -1.68209 -1.935069
H  0.993978 -0.016996 -1.547242
H  -1.829587 -2.432241 -0.936857
H  -2.520987 2.212617 0.831656
H  -4.364136 0.538573 0.974242
H  -0.767891 3.654361 0.159414
H  -0.160978 2.68694 1.558487
H  1.575187 4.395058 0.931111
H  2.174041 2.742251 0.525921
H  1.56522 3.817998 -0.765534
H  2.80125 -2.654676 -0.415185
H  5.519083 -1.010754 0.597327
H  5.431717 -0.580294 -1.128689
H  5.015525 -2.24538 -0.604646
