program: Gaussian 09
title: 000146901
version: EM64L-G09RevD.01
frameworkgroup: C1[X(C14H13N)]
method: RPBEPBE
basis: SDD
operation: Freq
keyword: #pfreq=noraman
keyword: PBEPBE/SDD
title: #p freq=noraman PBEPBE/SDD
converged: YES YES NO NO
title: Mulliken charges:
elementType: N C C C C C C C C C C C C C C H H H H H H H H H H H H H
charge: -0.238411 0.200269 0.227064 0.179988 0.232880 -0.595840 -0.367566 0.459788 -0.395458 -0.371339 -0.649229 -0.358818 -0.257526 -0.226996 -0.824569 0.238105 0.228835 0.233192 0.231208 0.235540 0.235663 0.239316 0.225577 0.221520 0.220622 0.226935 0.226198 0.223050
chargesum: 0.00000
title: Mulliken charges with hydrogens summed into heavy atoms:
elementType: N C C C C C C C C C C C C C C
charge: -0.238411 0.200269 0.227064 0.179988 0.232880 -0.357735 -0.138730 0.459788 -0.162265 -0.140131 0.061290 -0.133241 -0.036007 -0.006374 -0.148386
polarizability: 2.53106798e+02 9.89679886e+00 1.70751579e+02 -2.64217909e-01 9.13862958e-01 7.06204793e+01
1716.lowfreq: -6.0486 0.0002 0.0005 0.0007 1.6478 6.6475 55.1263 57.7115 93.2252
frequency: 55.1053 57.6426 93.2145 113.9669 132.1287 174.0148 223.9273 262.0568 295.1615 331.8786 364.4628 393.4583 425.6436 451.4702 506.1840 550.1202 566.5493 582.5078 595.0851 626.8971 689.1155 723.0251 733.7484 751.8200 775.8284 802.5909 842.7465 850.2506 864.2929 895.0964 932.6220 939.2811 970.3353 984.0932 1012.4657 1024.5985 1048.1557 1052.5606 1116.2516 1123.2869 1128.3826 1153.9684 1166.8098 1189.6009 1241.2511 1255.6051 1301.9455 1329.4255 1356.5949 1391.1059 1399.8186 1404.3608 1434.4794 1438.8685 1464.8833 1471.4360 1471.9821 1476.2963 1484.1959 1495.4509 1498.2378 1581.7429 1589.5349 1615.2616 1642.2722 2970.1679 2972.0242 3048.0891 3058.6743 3079.5597 3095.1348 3117.8151 3124.4001 3126.9126 3133.2810 3146.9091 3147.2035 3163.4339
redmass: 1.0533 1.0608 3.5050 3.2716 3.5264 3.8652 3.6911 2.5582 4.6289 2.9516 4.7515 5.7713 3.0370 2.8440 5.1622 4.9594 3.6622 4.6209 3.3257 6.5121 5.0853 5.8061 2.3536 1.8362 2.8944 1.4403 3.7196 1.4896 4.8204 1.4299 1.3968 1.3480 1.3084 1.7279 2.3492 2.0770 1.5220 4.5945 1.3111 1.6504 1.5406 1.4066 1.1664 1.9503 2.1189 1.9447 1.7308 2.1511 3.4504 3.9042 1.3788 3.4305 1.8601 2.4381 1.8378 1.0461 1.5683 1.1453 1.2870 2.6081 1.9764 6.8220 6.5883 7.2785 7.5106 1.0393 1.0373 1.0978 1.0949 1.0984 1.1005 1.0877 1.0852 1.0911 1.0893 1.0956 1.0951 1.1002
irintensity: 0.5275 0.0645 3.6492 0.4076 2.1437 0.4825 0.0465 0.8837 0.0219 1.2021 3.5760 0.7057 7.0286 0.0123 0.6723 7.1496 5.8884 2.2296 9.1115 3.9789 2.2678 0.3057 29.2207 59.7668 8.4084 53.9642 11.2933 0.0371 1.0863 6.5989 2.0370 0.5915 0.0074 7.5150 1.8433 17.7545 11.3996 1.5803 7.1208 14.6094 11.2809 11.4169 7.2547 0.0093 6.5964 34.7758 7.8742 51.2146 24.0146 1.5948 14.0144 9.6764 7.8017 3.3799 13.1110 12.4457 51.5823 41.9319 32.8740 34.2787 55.8399 1.1848 4.6484 21.9795 5.5612 95.5555 45.0222 24.6435 26.6720 18.2407 11.2729 12.3715 0.0873 15.5521 5.3487 12.3677 46.5731 33.6652
temp: 298.150 k
press: 1.00000 atm
elementType: 7 6 6 6 6 6 6 6 6 6 6 6 6 6 6 1 1 1 1 1 1 1 1 1 1 1 1 1
symmnumber: 1
zpe: 598735.5 jmol-1
zpe.correction: 0.228046 hartree
zpe.thermalcorrener: 0.240731 hartree
zpe.thermalcorrenthalpy: 0.241676 hartree
zpe.thermalcorrgfe: 0.188654 hartree
zpe.sumelectzpe: -595.028186 hartree
zpe.sumelectthermal: -595.015501 hartree
zpe.sumelectthermalent: -595.014556 hartree
zpe.sumelectthermalfe: -595.067578 hartree
dipole: 0.0290 1.9024 0.0268
dipole: 1.9028
quadrupole: -78.9943 -73.0756 -94.8684
quadrupole: -3.1790 -0.0207 -0.0311
quadrupole: 3.3185 9.2372 -12.5556 -3.1790 -0.0207 -0.0311
hfenergy: -595.256232 hartree
pointgroup: C01 [X(C14H13N1)]
dipole: 0.0503551 0.7466478 0.0207532 debye
polarizability: 253.9110451|5.5405878|169.9017177|0.7780063|2.2794785|70.6660933 unknown
InChI: InChI=1S/C14H13N/c1-10-7-8-14-12(9-10)11-5-3-4-6-13(11)15(14)2/h3-9H,1-2H3
charge 0 multiplicity 1
28 atoms
N  -0.569501 1.567091 -0.005181
C  0.538931 -0.468336 -0.01205
C  0.702672 0.959195 0.007307
C  -0.895462 -0.726835 -0.022317
C  -1.549387 0.556373 -0.008832
C  1.682156 -1.301874 -0.015901
C  1.984509 1.549683 0.031571
C  2.975308 -0.731086 0.002081
C  -1.677963 -1.904565 -0.04027
C  -2.956517 0.67339 -0.003903
C  -0.830204 3.003042 0.035382
C  3.103877 0.691882 0.026888
C  -3.08509 -1.794842 -0.041682
C  -3.714194 -0.518262 -0.022598
C  4.220476 -1.603727 -0.002121
H  1.570046 -2.392609 -0.031392
H  2.120345 2.635957 0.060787
H  -1.200229 -2.890716 -0.05206
H  -3.455017 1.648125 0.021244
H  -0.000856 3.547371 -0.446586
H  -1.753506 3.233283 -0.523307
H  -0.942409 3.376701 1.072103
H  4.109663 1.130134 0.046186
H  -3.70307 -2.699146 -0.054597
H  -4.808481 -0.457717 -0.01893
H  4.845633 -1.412929 -0.89534
H  4.853796 -1.410638 0.884635
H  3.960674 -2.676446 0.000184
