program: Gaussian 09
title: 000146889
version: EM64L-G09RevD.01
frameworkgroup: C1[X(C10H21N2O)]
method: RPBEPBE
basis: SDD
operation: Freq
keyword: #p
keyword: freq=noraman
keyword: PBEPBE/SDD
title: #p freq=noraman PBEPBE/SDD
converged: YES YES NO NO
title: Mulliken charges:
elementType: O N N C C C C C C C C C C H H H H H H H H H H H H H H H H H H H H H
charge: -0.327512 -0.072903 -0.072893 -0.254488 -0.380264 0.283024 -0.128837 -0.128918 -0.657558 -0.580265 -0.635930 -0.635793 -0.580168 0.217723 0.217372 0.217957 0.217974 0.237558 0.237551 0.214604 0.246322 0.214742 0.261218 0.263367 0.238064 0.249824 0.305222 0.257673 0.249988 0.257590 0.305076 0.261240 0.238047 0.263390
chargesum: 1.00000
title: Mulliken charges with hydrogens summed into heavy atoms:
elementType: O N N C C C C C C C C C C
charge: -0.327512 -0.072903 -0.072893 0.180607 0.055667 0.283024 0.108722 0.108634 0.018110 0.182385 0.176790 0.176861 0.182509
polarizability: 2.21036307e+02 -2.01664117e-02 1.30270710e+02 -4.78646684e-03 5.26806963e+00 8.87224329e+01
1716.lowfreq: -8.8572 -4.4845 0.0001 0.0007 0.0007 7.4542 31.5218 52.8200 53.2253
frequency: 31.4976 52.8133 53.1995 73.2063 73.9860 107.9691 109.9189 121.1559 123.8974 156.5262 159.5102 178.1936 218.2767 266.0704 275.7269 285.6450 302.3518 327.0414 339.8807 367.5496 415.6894 448.5357 452.5609 488.0473 622.5386 754.7397 762.6967 812.5404 815.3925 872.8402 879.9925 886.6892 906.3744 918.8323 948.6539 1037.9891 1038.4851 1046.9068 1091.0433 1091.5968 1104.7124 1123.7221 1131.3488 1132.5829 1144.6701 1144.7591 1177.3159 1203.1556 1222.1945 1279.6894 1293.7889 1297.7881 1335.4745 1377.2740 1405.1936 1407.2252 1426.6440 1432.5279 1439.3568 1440.9501 1451.3430 1458.4186 1458.8688 1463.4159 1467.2394 1471.8657 1478.7334 1482.9710 1489.2956 1489.3967 1491.3920 1495.3799 1499.9381 1628.0537 1648.4047 2968.9819 2989.1378 2991.6632 2992.1721 2995.8750 2996.5817 3000.7567 3025.2564 3056.3290 3074.3919 3075.0370 3084.1970 3084.4864 3086.2718 3097.3303 3122.5373 3123.4695 3130.1368 3137.0557 3150.8651 3151.4454
redmass: 3.5232 2.3078 1.8983 2.1710 2.6826 1.2119 1.1641 2.6393 1.6212 1.3700 1.3663 2.3958 1.1100 2.5367 2.9736 3.1151 3.3592 6.2051 3.4669 2.9291 2.3724 2.9469 4.3405 2.9105 4.2409 1.3762 2.5928 4.9210 6.7164 3.9025 1.2650 1.2094 1.9167 1.4437 5.0469 1.6750 1.7332 2.8781 1.2247 1.2335 1.6056 1.8055 2.2150 1.3962 1.4001 1.3974 2.0845 2.3760 1.2912 1.1088 2.1427 1.3660 2.3484 1.7631 1.2041 1.7192 1.1835 1.1667 1.2057 1.2392 1.2786 1.0475 1.0427 1.0576 1.0571 1.0635 1.0623 1.0405 1.0778 1.0560 1.0861 1.0494 1.2040 4.3688 5.7147 1.0561 1.0371 1.0362 1.0362 1.0347 1.0350 1.0595 1.1060 1.1045 1.1012 1.1012 1.1025 1.1025 1.1020 1.0991 1.0999 1.1013 1.0921 1.0899 1.1004 1.1003
irintensity: 0.0043 0.2267 0.2599 0.5255 3.3191 0.2933 0.3071 1.0199 0.1965 0.0161 0.0966 0.3069 0.2577 0.1199 2.4181 2.8513 0.2006 10.5170 0.4984 19.5458 5.7575 5.3580 6.2115 0.7836 19.1653 4.7937 0.0213 22.7510 9.1801 7.4862 12.2872 0.2972 0.9826 18.7983 120.9347 29.3455 29.9933 2.3484 1.8282 11.3199 164.1386 42.4827 1.5824 0.8324 0.2541 0.0872 19.5469 3.0003 0.9557 3.7069 110.2243 6.4749 57.7419 7.6509 13.0973 68.3529 6.3391 10.8316 6.3682 36.2309 2.3697 21.6160 1.5816 13.8381 0.5436 20.5531 10.4319 14.8878 27.8187 11.7562 17.8490 49.0037 12.7990 1063.4787 2.9556 22.8539 23.3033 23.7493 17.7211 90.2984 6.2029 28.8146 8.1771 10.2387 11.5649 14.8349 7.8660 12.1399 57.1365 23.8499 4.4917 7.6048 3.1665 8.0056 4.8126 2.1369
temp: 298.150 k
press: 1.00000 atm
elementType: 8 7 7 6 6 6 6 6 6 6 6 6 6 1 1 1 1 1 1 1 1 1 1 1 1 1 1 1 1 1 1 1 1 1
symmnumber: 1
zpe: 791004.5 jmol-1
zpe.correction: 0.301278 hartree
zpe.thermalcorrener: 0.318650 hartree
zpe.thermalcorrenthalpy: 0.319594 hartree
zpe.thermalcorrgfe: 0.255249 hartree
zpe.sumelectzpe: -577.069171 hartree
zpe.sumelectthermal: -577.051799 hartree
zpe.sumelectthermalent: -577.050855 hartree
zpe.sumelectthermalfe: -577.115200 hartree
dipole: 0.0001 -3.9486 -1.3708
dipole: 4.1798
quadrupole: -31.5490 -54.9389 -78.4373
quadrupole: -0.0204 0.0173 3.1816
quadrupole: 23.4261 0.0362 -23.4622 -0.0204 0.0173 3.1816
hfenergy: -577.3704488 hartree
pointgroup: C01 [X(C10H21N2O1)]
dipole: -0.3015403 -1.4716031 -0.6690782 debye
polarizability: 217.3440376|-18.0519193|132.7739865|1.5922564|8.5569302|89.9114259 unknown
InChI: InChI=1S/C10H21N2O/c1-6-7-13-10(8-11(2)3)9-12(4)5/h8-9H,6-7H2,1-5H3
charge 1 multiplicity 1
34 atoms
O  0.123491 0.503144 0.632622
N  -2.640456 -0.591267 -0.050717
N  2.234688 -1.589402 -0.056567
C  0.356938 1.663207 -0.305862
C  0.608107 2.904454 0.54943
C  -0.128867 -0.72914 -0.019147
C  -1.447626 -1.156096 -0.331672
C  0.915385 -1.63933 -0.335194
C  0.877048 4.148625 -0.327733
C  -3.895119 -1.209624 -0.546866
C  -2.842864 0.621928 0.778757
C  2.900586 -0.55117 0.767799
C  3.143645 -2.654006 -0.550003
H  -0.537835 1.781148 -0.949382
H  1.226985 1.425697 -0.950347
H  -0.267375 3.082958 1.201729
H  1.469973 2.718791 1.217732
H  -1.522514 -2.105712 -0.875231
H  0.609856 -2.541334 -0.879216
H  0.021089 4.373168 -0.99036
H  1.048557 5.034521 0.306685
H  1.772266 4.013774 -0.962101
H  -4.460595 -0.474659 -1.146626
H  -4.522494 -1.525745 0.30539
H  -3.676687 -2.085294 -1.176987
H  -3.264445 1.435324 0.159865
H  -1.89215 0.938457 1.224531
H  -3.564864 0.388353 1.581262
H  3.605234 0.029473 0.144494
H  3.475636 -1.047363 1.569596
H  2.15216 0.114244 1.214811
H  3.952888 -2.204033 -1.15188
H  2.596797 -3.3751 -1.176465
H  3.595663 -3.188393 0.304352
