program: Gaussian 09
title: 000146954
version: EM64L-G09RevD.01
frameworkgroup: C1[X(C16H16ClNO6S2)]
method: RPBEPBE
basis: SDD
operation: Freq
keyword: #p
keyword: freq=noraman
keyword: PBEPBE/SDD
title: #p freq=noraman PBEPBE/SDD
converged: YES YES NO NO
title: Mulliken charges:
elementType: Cl S S O O O O O O N C C C C C C C C C C C C C C C C H H H H H H H H H H H H H H H H
charge: -0.028386 0.960770 0.901181 -0.273686 -0.525808 -0.505348 -0.526580 -0.520567 -0.254926 -0.391669 0.012906 -0.428045 -0.364194 -0.124790 0.009257 -0.173794 -0.211677 -0.261324 -0.204298 -0.345986 -0.337589 -0.181928 -0.198513 0.346725 -0.095616 -0.537470 0.275520 0.254599 0.279305 0.215570 0.227769 0.306631 0.292217 0.293754 0.333502 0.259035 0.267503 0.269121 0.271742 0.229984 0.253689 0.231414
chargesum: 0.00000
title: Mulliken charges with hydrogens summed into heavy atoms:
elementType: Cl S S O O O O O O N C C C C C C C C C C C C C C C C
charge: -0.028386 0.960770 0.901181 -0.273686 -0.525808 -0.505348 -0.526580 -0.520567 -0.254926 -0.391669 0.288425 0.105859 0.079145 -0.124790 0.009257 0.132837 0.080540 0.032431 0.129204 -0.086951 -0.070086 0.087194 0.073229 0.346725 -0.095616 0.177618
polarizability: 4.15505706e+02 1.77125804e+00 2.48375772e+02 7.83722617e+00 -3.90152768e+00 2.05240196e+02
1716.lowfreq: -2.0685 -0.0013 -0.0008 0.0017 3.6049 7.1825 14.3379 19.4798 23.2403
frequency: 14.1475 19.4493 23.2232 42.4376 48.8422 51.9357 60.3661 68.0604 94.5150 96.7773 110.0381 120.7969 129.5271 141.9723 154.0863 168.0292 186.3759 202.9505 210.7464 216.8153 224.9182 229.9901 242.3613 263.1911 283.2148 298.5197 317.3605 343.3534 356.3837 373.6961 390.5134 401.0268 410.8601 418.0079 418.7593 425.6146 463.1932 473.0502 497.8624 513.4231 522.1677 552.0055 583.7856 611.1337 615.0787 698.5562 701.6899 705.3862 710.8113 759.9395 800.8378 804.3544 807.3297 815.4333 832.7769 839.2995 843.1590 871.4533 917.0675 925.6826 939.4356 949.5712 961.1838 967.1277 971.4826 976.3242 977.5339 981.0476 985.4385 1033.9478 1039.6747 1046.5543 1067.5602 1093.9763 1112.1154 1112.6981 1114.0595 1116.8239 1131.4737 1156.0698 1182.6784 1185.9084 1231.1733 1242.4179 1254.1192 1292.2255 1295.8402 1316.1646 1376.1385 1381.1714 1384.3449 1385.6677 1404.8336 1416.5010 1435.9490 1454.1357 1467.2886 1469.9450 1473.8619 1480.1146 1566.2125 1579.7827 1591.6526 1595.1983 2959.5029 2972.5301 3030.3085 3064.7930 3066.4886 3117.6774 3137.2803 3137.3699 3159.7022 3160.2647 3170.3316 3173.6622 3178.9245 3180.0360 3181.9563 3188.0729
redmass: 6.1993 9.4656 6.7926 5.1734 4.6742 6.0245 4.5908 4.8030 4.8780 6.6301 7.8711 10.5483 6.6654 5.2600 6.5418 10.1704 9.6192 11.3631 1.9784 3.8488 2.3088 8.5561 5.3929 7.0008 5.1905 6.1530 8.1642 6.0215 5.4119 5.6345 9.3557 4.8131 3.0330 3.0158 6.1794 5.7288 6.1483 4.6242 4.0477 3.0683 6.3240 6.6029 6.6773 7.1369 7.0870 4.5196 6.1935 5.4830 3.3698 5.8705 2.6116 3.1469 4.8499 3.1710 1.2938 1.5602 1.3634 2.2505 2.2864 7.2130 1.5300 9.6569 2.9251 1.3338 1.6437 3.7996 5.3792 5.3826 1.4541 1.3114 2.4734 2.8806 2.9738 1.8703 1.3441 1.2583 1.2880 1.2989 1.5357 1.3207 1.2170 1.1533 1.5345 3.3911 1.2459 1.2447 1.2643 1.2471 1.7880 11.5615 2.7481 5.3025 1.0777 4.2115 1.1937 2.0245 1.3705 1.0493 1.4707 1.1713 5.8700 6.9287 8.0442 6.3465 1.0562 1.0325 1.1029 1.0531 1.1047 1.0950 1.0921 1.1001 1.0890 1.0897 1.0883 1.1179 1.0945 1.0968 1.0969 1.0967
irintensity: 0.7058 0.9601 0.4191 1.3629 1.5046 0.1951 5.2376 2.1304 0.6359 1.4961 1.3778 3.9780 3.0030 2.5212 9.1338 2.6633 5.0914 12.0119 10.6872 1.3295 1.1852 1.5234 0.6692 0.6417 19.9067 4.5031 4.8198 2.2110 11.5770 6.5195 78.4904 64.7838 4.4005 0.3091 111.5688 36.8841 13.0091 42.0284 42.7347 77.0313 90.9805 69.6252 17.9915 3.1950 1.3028 5.2871 43.0855 15.5142 0.8270 15.2812 43.7657 84.3657 0.7131 65.3896 19.6928 65.2292 49.2023 7.3645 14.6292 51.9523 4.5662 49.2456 29.9843 0.5705 12.6913 18.5825 43.7368 23.9430 2.2110 8.3880 51.4116 34.4990 59.6019 15.6456 6.5526 0.1783 7.0591 11.1894 3.7213 8.6264 153.3685 9.4851 3.9044 234.8997 1.1175 1.6284 5.9616 9.1901 13.5974 4.4331 16.3371 7.9891 30.8132 7.7612 27.1464 89.4847 129.5723 15.4534 7.9473 2.8694 33.9196 75.7296 4.4063 118.1197 9.5959 58.4406 4.9421 31.1706 36.0753 55.0075 5.0451 19.8915 1.4720 3.1511 4.5789 23.4433 0.8418 2.7364 4.5978 12.7548
temp: 298.150 k
press: 1.00000 atm
elementType: 17 16 16 8 8 8 8 8 8 7 6 6 6 6 6 6 6 6 6 6 6 6 6 6 6 6 1 1 1 1 1 1 1 1 1 1 1 1 1 1 1 1
symmnumber: 1
zpe: 768604.7 jmol-1
zpe.correction: 0.292746 hartree
zpe.thermalcorrener: 0.320114 hartree
zpe.thermalcorrenthalpy: 0.321059 hartree
zpe.thermalcorrgfe: 0.231740 hartree
zpe.sumelectzpe: -2379.238539 hartree
zpe.sumelectthermal: -2379.211170 hartree
zpe.sumelectthermalent: -2379.210226 hartree
zpe.sumelectthermalfe: -2379.299545 hartree
dipole: -4.7199 -1.2829 -4.1168
dipole: 6.3931
quadrupole: -142.3843 -162.2847 -188.0426
quadrupole: 7.5701 1.6661 -7.1281
quadrupole: 21.8529 1.9525 -23.8054 7.5701 1.6661 -7.1281
hfenergy: -2379.5312849 hartree
pointgroup: C01 [X(C16H16Cl1N1O6S2)]
dipole: -1.8308541 1.1044719 1.3245838 debye
polarizability: 412.100668|7.9703029|233.7584212|-24.2912625|-22.3079863|223.2625843 unknown
InChI: InChI=1S/C16H16ClNO6S2/c1-23-13-4-8-16(9-5-13)26(21,22)18(10-14-11-24-14)25(19,20)15-6-2-12(17)3-7-15/h2-9,14H,10-11H2,1H3
charge 0 multiplicity 1
42 atoms
Cl 6.776579 1.937998 -2.252604
S  -0.634209 -0.969137 -1.225581
S  1.196777 0.910446 0.800398
O  2.271906 -3.50648 1.530608
O  -0.041578 0.005028 -2.379295
O  -0.786656 -2.575559 -1.442555
O  1.512401 0.83054 2.402033
O  0.081457 1.969721 0.26943
O  -6.12956 0.827968 0.517683
N  0.792641 -0.928396 0.208543
C  1.584679 -2.306265 2.120455
C  0.369893 -1.774784 1.370329
C  1.494468 -3.631381 2.817841
C  -2.310424 -0.346056 -0.655644
C  2.823426 1.165381 -0.109669
C  -2.585286 1.029966 -0.697103
C  -3.25048 -1.317874 -0.250886
C  3.963662 1.39187 0.677671
C  2.819317 1.150582 -1.514294
C  -3.870952 1.461747 -0.311649
C  -4.525729 -0.878071 0.136968
C  5.186082 1.632158 0.011343
C  4.046845 1.389211 -2.171087
C  -4.837229 0.509206 0.111288
C  5.203283 1.628795 -1.398611
C  -6.52801 2.242762 0.518447
H  2.266163 -1.546344 2.517801
H  -0.294646 -1.242521 2.082279
H  -0.172435 -2.63141 0.922011
H  0.570315 -4.21901 2.738679
H  2.099325 -3.808739 3.714894
H  -1.820338 1.744702 -1.009802
H  -2.997376 -2.382227 -0.273512
H  3.901386 1.384012 1.770247
H  1.905441 0.934036 -2.081177
H  -4.099558 2.53025 -0.336604
H  -5.297886 -1.584686 0.453152
H  6.101691 1.816569 0.579405
H  4.098611 1.379344 -3.263002
H  -6.479754 2.670083 -0.500863
H  -7.567953 2.243388 0.873926
H  -5.895291 2.833778 1.207009
