program: Gaussian 09
title: 000146893
version: EM64L-G09RevD.01
frameworkgroup: C1[X(C14H13N)]
method: RPBEPBE
basis: SDD
operation: Freq
keyword: #pfreq=noraman
keyword: PBEPBE/SDD
title: #p freq=noraman PBEPBE/SDD
converged: YES YES NO NO
title: Mulliken charges:
elementType: N C C C C C C C C C C C C C C H H H H H H H H H H H H H
charge: -0.248852 0.245417 0.181680 0.199489 0.231268 -0.578562 -0.398663 0.493500 -0.401626 -0.372821 -0.648862 -0.385685 -0.255273 -0.228883 -0.820581 0.235493 0.232164 0.233117 0.229499 0.236510 0.235720 0.239314 0.224941 0.221448 0.220496 0.220511 0.228873 0.230368
chargesum: 0.00000
title: Mulliken charges with hydrogens summed into heavy atoms:
elementType: N C C C C C C C C C C C C C C
charge: -0.248852 0.245417 0.181680 0.199489 0.231268 -0.343069 -0.166499 0.493500 -0.168509 -0.143321 0.062683 -0.160744 -0.033825 -0.008387 -0.140829
polarizability: 2.62457728e+02 -2.59426547e-01 1.64174391e+02 -2.05227542e-01 8.78091873e-01 7.06599362e+01
1716.lowfreq: -0.0008 0.0002 0.0003 6.3735 7.6267 9.9579 44.0309 45.3234 81.5402
frequency: 44.0160 45.2992 81.5324 121.0657 143.3187 179.5938 210.4480 259.2932 313.0693 327.1156 341.7214 393.9442 433.3016 454.8643 536.8587 541.6987 572.8300 581.9139 599.9203 603.0295 700.5502 725.9402 732.9124 752.1963 773.3259 803.4415 818.7418 852.5061 862.5937 917.2767 932.8675 951.7639 970.7837 987.4931 1000.9180 1018.3732 1044.6122 1051.0367 1115.4262 1118.6012 1129.8764 1139.5254 1170.1638 1199.2771 1241.9570 1255.2691 1305.4291 1321.9594 1354.6847 1389.5637 1395.6269 1405.6631 1430.7906 1455.5767 1458.9130 1468.2966 1470.7880 1475.3006 1482.2017 1492.0044 1504.9279 1579.6784 1589.7571 1614.9472 1641.9633 2970.6903 2973.5901 3051.2786 3059.2649 3080.0653 3095.4133 3119.6705 3124.5374 3130.3577 3133.1679 3145.5591 3146.6582 3163.2652
redmass: 1.0445 1.0591 3.7787 3.0308 3.6374 3.7947 3.8758 2.6102 5.0474 3.0772 4.1467 4.9356 2.8859 3.0615 5.2287 5.2350 3.8030 4.9053 5.3339 3.4418 5.5641 5.3039 2.3906 1.7921 2.6177 4.9346 1.4226 1.5259 1.4578 2.6375 1.3967 1.3495 1.3071 5.1938 1.6171 2.0691 1.5414 3.7349 1.3112 1.6210 1.5629 1.3963 1.0957 1.9408 2.5025 1.9261 1.7622 2.0564 2.9495 4.1624 1.3103 4.3811 1.6548 2.6272 1.8995 1.0466 1.9125 1.1329 1.3076 1.5561 2.8154 6.9854 6.6768 7.2742 7.5257 1.0393 1.0370 1.0976 1.0949 1.0987 1.1005 1.0870 1.0846 1.0915 1.0891 1.0965 1.0953 1.1002
irintensity: 0.5624 0.0681 1.0629 5.0853 0.0336 0.4125 0.1003 0.4402 0.4957 0.9566 0.6126 0.1928 12.8755 1.3476 5.5007 2.7702 0.9967 3.6346 1.2934 3.4847 3.0472 0.9277 37.2777 57.6406 23.0624 1.9267 38.6158 0.6646 8.7219 7.4457 2.2609 0.5976 0.0254 2.3000 19.1309 9.7506 12.7440 2.7703 6.0760 20.6272 9.9278 6.7527 4.1727 9.8332 4.2519 30.4690 8.1998 39.8514 20.0189 11.9974 8.5989 28.6002 12.7076 15.4782 6.7640 12.9201 40.8713 46.0887 27.3821 43.4363 5.1009 1.1624 0.0808 61.5430 24.0552 75.2958 53.5293 21.9079 26.4480 20.8816 10.6285 10.9608 0.2952 20.7184 4.2679 4.8283 52.7843 34.7444
temp: 298.150 k
press: 1.00000 atm
elementType: 7 6 6 6 6 6 6 6 6 6 6 6 6 6 6 1 1 1 1 1 1 1 1 1 1 1 1 1
symmnumber: 1
zpe: 598634.4 jmol-1
zpe.correction: 0.228008 hartree
zpe.thermalcorrener: 0.240733 hartree
zpe.thermalcorrenthalpy: 0.241677 hartree
zpe.thermalcorrgfe: 0.188248 hartree
zpe.sumelectzpe: -595.028877 hartree
zpe.sumelectthermal: -595.016151 hartree
zpe.sumelectthermalent: -595.015207 hartree
zpe.sumelectthermalfe: -595.068637 hartree
dipole: 0.6619 2.0356 0.0211
dipole: 2.1406
quadrupole: -79.4024 -73.3324 -94.8704
quadrupole: -0.8924 -0.0525 -0.0457
quadrupole: 3.1327 9.2027 -12.3353 -0.8924 -0.0525 -0.0457
hfenergy: -595.2568846 hartree
pointgroup: C01 [X(C14H13N1)]
dipole: 0.2584241 0.8012912 0.0203271 debye
polarizability: 262.4577249|-0.0094334|164.1245844|-0.4178446|2.3155012|70.7097458 unknown
InChI: InChI=1S/C14H13N/c1-10-7-8-12-11-5-3-4-6-13(11)15(2)14(12)9-10/h3-9H,1-2H3
charge 0 multiplicity 1
28 atoms
N  -0.303617 1.450852 -0.001317
C  0.819429 0.600398 -0.002422
C  0.369096 -0.76453 -0.021734
C  -1.087818 -0.729515 -0.018149
C  -1.469389 0.6590 0.003391
C  2.191931 0.933091 0.009663
C  1.330189 -1.801501 -0.038102
C  3.144388 -0.113154 -0.007385
C  -2.091339 -1.725427 -0.029893
C  -2.823633 1.056645 0.021716
C  -0.264824 2.910039 0.041393
C  2.699934 -1.471346 -0.032336
C  -3.447783 -1.334578 -0.017642
C  -3.80652 0.042047 0.008789
C  4.632812 0.194824 0.003474
H  2.528651 1.97555 0.039535
H  1.016572 -2.851394 -0.054346
H  -1.821928 -2.787513 -0.047375
H  -3.116371 2.111535 0.052649
H  0.616242 3.278703 -0.51109
H  -1.164409 3.32204 -0.445818
H  -0.217599 3.294832 1.078951
H  3.450206 -2.271271 -0.044142
H  -4.235338 -2.095847 -0.025583
H  -4.865972 0.3222 0.023007
H  4.823651 1.27954 0.076144
H  5.137621 -0.293987 0.85805
H  5.125419 -0.172635 -0.916827
