program: Gaussian 09
title: 000146872
version: EM64L-G09RevD.01
frameworkgroup: C1[X(C10H15N5O2)]
method: RPBEPBE
basis: SDD
operation: Freq
keyword: #p
keyword: freq=noraman
keyword: PBEPBE/SDD
title: #p freq=noraman PBEPBE/SDD
converged: YES YES NO NO
title: Mulliken charges:
elementType: O O N N N N N C C C C C C C C C C H H H H H H H H H H H H H H H
charge: -0.304568 -0.272244 -0.143523 -0.383849 -0.371871 -0.638165 -0.333970 0.263258 -0.460904 0.343430 -0.376363 -0.395355 0.166864 -0.441671 -0.594488 0.112998 -0.081358 0.295042 0.261187 0.243140 0.258123 0.339708 0.211490 0.244741 0.254764 0.205421 0.270414 0.302550 0.171202 0.323149 0.325864 0.204985
chargesum: 0.00000
title: Mulliken charges with hydrogens summed into heavy atoms:
elementType: O O N N N N N C C C C C C C C C C
charge: -0.304568 -0.272244 -0.143523 -0.044141 -0.069322 0.010848 -0.128986 0.263258 -0.165862 0.343430 0.127964 -0.137232 0.166864 0.014561 0.136110 0.112998 0.089844
polarizability: 2.01511954e+02 1.49193068e+00 1.88071022e+02 1.33441051e+01 -6.54633753e+00 8.41107843e+01
1716.lowfreq: -31.8117 -6.1156 -0.0006 -0.0004 -0.0003 3.3357 6.1530 19.4610 26.8531
frequency: -31.0614 18.7439 26.6518 46.8627 55.9492 68.8452 79.9278 101.0427 131.7898 170.7880 184.8532 229.2071 252.6541 269.2392 300.1947 339.9612 383.9283 385.2999 422.4426 427.5574 441.2925 484.1375 505.8718 524.7066 560.9764 600.7463 618.2007 622.0506 647.4187 669.5774 713.6464 723.9654 749.4990 767.7704 819.8239 833.4696 837.4264 848.5197 870.6744 936.1836 976.9763 981.5116 1009.1761 1048.4404 1058.5923 1073.1548 1088.8577 1107.2482 1120.4813 1138.1146 1180.3766 1189.3354 1207.4857 1230.6469 1264.9204 1302.2034 1340.3861 1355.2362 1362.9095 1374.6990 1396.1626 1411.3820 1448.5683 1450.6644 1455.0080 1463.1737 1470.8520 1487.0897 1497.7008 1510.3080 1580.3187 1599.5631 1615.4204 1627.6893 1640.2670 2939.4883 3004.5373 3011.1966 3012.2745 3085.5861 3099.2128 3112.5334 3120.1464 3220.2343 3240.2660 3306.0979 3510.5694 3531.7944 3540.4723 3654.4174
redmass: 1.0838 4.2448 5.3705 4.6523 7.1351 4.9112 4.0566 5.5812 4.1643 5.8861 3.1810 3.8797 4.2895 3.8413 3.4430 4.0323 6.5756 3.4957 2.1623 1.4909 2.0447 2.2174 1.2516 3.3897 5.3689 2.3381 1.5270 1.4876 1.6699 2.9357 4.2006 3.1351 2.3671 2.8056 3.9133 3.0780 1.6503 1.4457 2.4490 1.5765 2.3765 5.2364 2.0603 2.2347 1.6260 2.1284 1.5215 1.5825 1.3161 2.9815 2.0915 1.2536 1.4127 1.3413 2.2355 1.3344 1.3634 3.0324 1.4257 2.5947 4.1261 2.2916 1.0783 2.2933 1.1149 1.2987 1.5647 1.3964 1.8785 2.1762 5.5844 5.0615 1.5636 5.6520 2.4714 1.0864 1.0657 1.0613 1.0332 1.1002 1.0999 1.1021 1.1026 1.0981 1.0987 1.0758 1.0454 1.0774 1.0771 1.1034
irintensity: 0.4957 3.3136 0.4585 3.1621 23.0859 0.5565 2.7998 9.3628 8.5575 4.9911 10.6563 1.0503 11.1848 5.6097 15.8583 3.8515 6.8224 24.9548 64.8193 186.3286 15.5474 119.2556 140.9950 5.7064 5.2773 6.8592 38.7442 48.1700 20.7526 22.6129 7.1409 1.0787 49.9505 11.6825 4.2208 12.7640 49.7653 72.4550 13.4035 2.6987 8.8880 2.3155 24.7649 10.1090 17.0234 3.2165 75.7008 45.1786 1.5938 18.5413 1.2293 14.3675 45.7894 10.8900 191.8323 27.7369 3.1206 11.4122 9.5517 88.7286 23.4943 71.3202 21.8474 45.7436 18.9817 92.8787 15.3459 61.1926 132.2126 288.5789 253.2666 38.7333 14.1614 318.7475 168.0582 128.7188 16.0258 41.5958 41.2324 5.7075 16.6293 14.9095 11.8190 0.6981 3.4197 26.0370 16.3513 16.2103 27.4813 13.5320
temp: 298.150 k
press: 1.00000 atm
elementType: 8 8 7 7 7 7 7 6 6 6 6 6 6 6 6 6 6 1 1 1 1 1 1 1 1 1 1 1 1 1 1 1
symmnumber: 1
zpe: 670660.3 jmol-1
zpe.correction: 0.255441 hartree
zpe.thermalcorrener: 0.272478 hartree
zpe.thermalcorrenthalpy: 0.273422 hartree
zpe.thermalcorrgfe: 0.208075 hartree
zpe.sumelectzpe: -813.002791 hartree
zpe.sumelectthermal: -812.985754 hartree
zpe.sumelectthermalent: -812.984810 hartree
zpe.sumelectthermalfe: -813.050157 hartree
dipole: 6.6761 0.7600 0.7823
dipole: 6.7646
quadrupole: -89.5218 -103.7463 -102.4509
quadrupole: -1.5233 -3.3356 2.1136
quadrupole: 9.0512 -5.1733 -3.8779 -1.5233 -3.3356 2.1136
hfenergy: -813.258232 hartree
pointgroup: C01 [X(C10H15N5O2)]
dipole: 2.6331235 -0.0578741 -0.382683 debye
polarizability: 200.8993944|0.4155902|188.4633098|-15.8887376|-1.1682539|84.3310553 unknown
InChI: InChI=1S/C10H15N5O2/c1-15-5-7(14-6-16)4-8(15)10(17)13-3-2-9(11)12/h4-6,11,13-14H,2-3,12H2,1H3
charge 0 multiplicity 1
32 atoms
O  -0.816936 2.876226 -0.07952
O  1.777144 -3.155449 -0.217138
N  1.958732 1.850478 0.058521
N  -1.5448 0.764087 0.616043
N  3.423281 -1.46974 -0.165933
N  -2.427286 -1.923696 -0.63483
N  -4.545311 -1.871666 0.560306
C  0.796797 1.071156 0.142515
C  1.175929 -0.287506 0.07318
C  2.598969 -0.322351 -0.051991
C  -2.980933 1.06035 0.552356
C  3.060299 1.010532 -0.055514
C  -0.563233 1.658886 0.217839
C  -3.720495 0.17455 -0.492432
C  2.0378 3.323019 0.091048
C  -3.602832 -1.311926 -0.167393
C  2.984761 -2.782038 -0.240557
H  0.533483 -1.163942 0.081967
H  -3.078619 2.126551 0.286372
H  -3.443302 0.900593 1.544094
H  4.070563 1.408993 -0.129907
H  -1.270628 -0.182225 0.887924
H  -3.323931 0.394248 -1.501697
H  -4.7916 0.432122 -0.471869
H  1.547489 3.715786 0.99589
H  3.10062 3.616126 0.090207
H  1.521871 3.756106 -0.7793
H  4.4337 -1.317546 -0.204659
H  3.835089 -3.49627 -0.325443
H  -2.258016 -2.917671 -0.480608
H  -1.822728 -1.445545 -1.302108
H  -4.367876 -2.877436 0.771038
