program: Gaussian 09
title: 000146890
version: EM64L-G09RevD.01
frameworkgroup: C1[X(C10H12BrNO4)]
method: RPBEPBE
basis: SDD
operation: Freq
keyword: #p
keyword: freq=noraman
keyword: PBEPBE/SDD
title: #p freq=noraman PBEPBE/SDD
converged: YES YES NO NO
title: Mulliken charges:
elementType: Br O O O O N C C C C C C C C C C H H H H H H H H H H H H
charge: 0.004486 -0.299690 -0.218772 -0.301234 -0.273274 -0.304591 0.366818 0.156119 -0.451235 -0.282774 -0.335006 -0.230863 -0.165925 -0.534537 0.330765 -0.494524 0.221203 0.266715 0.254188 0.258210 0.252807 0.233236 0.287439 0.207766 0.332365 0.234283 0.244752 0.241274
chargesum: 0.00000
title: Mulliken charges with hydrogens summed into heavy atoms:
elementType: Br O O O O N C C C C C C C C C C
charge: 0.004486 -0.299690 -0.218772 -0.301234 -0.273274 0.027774 0.366818 0.156119 0.036682 -0.028586 -0.076796 -0.230863 0.086882 0.193904 0.330765 0.225784
polarizability: 2.25599187e+02 -1.32237153e+01 1.51778467e+02 -6.97773225e+00 -6.25365992e+00 7.61679254e+01
1716.lowfreq: -6.7143 -3.4315 -0.0004 0.0002 0.0005 2.0491 21.6146 33.8438 53.1277
frequency: 21.4997 33.8264 53.1187 58.1414 76.4107 79.7921 88.2081 107.9459 141.8898 144.6206 179.8037 198.6806 219.5907 236.8141 264.6488 282.3505 304.0037 331.7592 382.5072 439.0959 461.2263 474.6777 515.1730 546.6334 590.3166 615.6700 656.2007 691.7712 732.4133 738.0817 831.8630 844.1090 866.6061 891.7714 909.2652 941.3255 957.5743 959.0481 979.8760 1064.5142 1069.7745 1107.2297 1117.7014 1123.9414 1146.3592 1148.7135 1164.1450 1188.0153 1193.9843 1221.0063 1259.0479 1335.2032 1367.2561 1394.4059 1402.4273 1436.5938 1437.0793 1452.8723 1461.5892 1465.1512 1470.0466 1476.3697 1483.4787 1568.0489 1596.3239 1666.8890 2972.6048 3003.5493 3012.3807 3082.9648 3091.3707 3105.1525 3131.3365 3147.4474 3152.7529 3155.9358 3176.3423 3539.1066
redmass: 5.3105 6.8957 5.3325 5.7621 4.5710 1.3494 3.4854 3.5115 2.2825 1.2660 4.2350 4.2194 4.4253 5.7798 8.0708 4.1584 6.3035 5.0008 4.0986 4.2222 1.2724 4.3106 5.0423 4.2327 4.8727 6.3295 6.1947 8.6288 4.1628 4.8597 1.5179 5.7867 2.3988 7.1879 2.4334 7.2825 4.2408 1.4886 1.8077 8.5407 1.9801 1.9207 1.2529 1.2278 1.4974 1.3251 1.1288 2.2031 2.1950 3.2099 1.2953 1.3874 5.6021 3.5282 1.3810 1.3012 1.3147 1.0502 1.2152 1.4064 1.0604 1.2157 1.1256 7.3882 7.4408 9.2129 1.0331 1.0297 1.0586 1.1018 1.1079 1.1049 1.1031 1.1045 1.0927 1.0885 1.0976 1.0790
irintensity: 0.5128 0.2265 4.1517 2.5774 1.2965 3.0156 5.0486 9.0344 5.8372 1.7862 1.3563 3.0568 9.0564 0.3249 2.1186 3.9380 38.2899 2.5951 2.7103 10.2190 145.3647 12.6483 4.3105 18.7411 30.7382 6.3450 21.5172 12.3839 1.6747 17.3345 24.8100 24.6316 48.3698 11.0679 7.0720 41.3540 7.1736 4.2613 1.1717 181.4298 14.6084 42.3620 1.0525 2.6597 111.5813 3.9764 16.9013 40.4402 329.9751 36.0021 8.2494 12.1435 14.1388 25.9416 123.2380 103.3013 21.1141 13.9694 47.7029 82.9012 9.0910 13.8199 2.8898 2.4016 3.9853 222.2539 63.3287 44.2448 29.7721 11.8455 6.8112 28.5213 22.2044 17.1197 2.9638 2.1001 4.3907 35.0654
temp: 298.150 k
press: 1.00000 atm
elementType: 35 8 8 8 8 7 6 6 6 6 6 6 6 6 6 6 1 1 1 1 1 1 1 1 1 1 1 1
symmnumber: 1
zpe: 545721.0 jmol-1
zpe.correction: 0.207854 hartree
zpe.thermalcorrener: 0.225422 hartree
zpe.thermalcorrenthalpy: 0.226366 hartree
zpe.thermalcorrgfe: 0.159046 hartree
zpe.sumelectzpe: -756.087180 hartree
zpe.sumelectthermal: -756.069613 hartree
zpe.sumelectthermalent: -756.068669 hartree
zpe.sumelectthermalfe: -756.135989 hartree
dipole: -2.5267 -1.2047 -0.1289
dipole: 2.8021
quadrupole: -88.6671 -96.9023 -104.5119
quadrupole: 10.4806 -0.8044 -5.9596
quadrupole: 8.0267 -0.2085 -7.8181 10.4806 -0.8044 -5.9596
hfenergy: -756.2950346 hartree
pointgroup: C01 [X(C10H12Br1N1O4)]
dipole: 1.068367 0.2719493 -0.0030028 debye
polarizability: 217.3444985|-27.4196296|157.9441048|7.9406476|12.642606|78.2569766 unknown
InChI: InChI=1S/C10H12BrNO4/c1-14-9-4-3-8(11)5-7(9)6-16-12-10(13)15-2/h3-5,12H,6H2,1-2H3
charge 0 multiplicity 1
28 atoms
Br -4.761195 2.392751 0.015189
O  -0.757951 -2.310768 0.270086
O  0.946006 0.899074 -0.208431
O  4.525875 0.962466 0.077752
O  3.129338 -0.927226 -0.182843
N  2.288006 1.248948 0.171637
C  -1.2120 0.100546 0.541349
C  -1.62841 -1.207895 0.162585
C  0.193964 0.367222 1.004223
C  -2.153905 1.159495 0.491729
C  -2.962779 -1.443672 -0.242082
C  -3.47393 0.908806 0.075314
C  -3.896797 -0.38679 -0.289097
C  0.189309 -2.495963 -0.861468
C  3.286819 0.304959 -0.010893
C  5.703581 0.06874 0.021966
H  0.237484 1.145796 1.786804
H  0.695928 -0.554212 1.343645
H  -1.847177 2.169587 0.781659
H  -3.260562 -2.463518 -0.504116
H  -4.929408 -0.570558 -0.598932
H  0.746743 -3.413041 -0.620288
H  0.89056 -1.647521 -0.937607
H  -0.372622 -2.6258 -1.806532
H  2.492353 2.249774 0.119106
H  6.568464 0.744529 0.078484
H  5.707805 -0.502896 -0.92111
H  5.694604 -0.633034 0.873172
