program: Gaussian 09
title: 000010131
version: EM64L-G09RevD.01
frameworkgroup: C1[X(C9H14O4)]
method: RPBEPBE
basis: SDD
operation: Freq
keyword: #pfreq=noraman
keyword: PBEPBE/SDD
title: #p freq=noraman PBEPBE/SDD
converged: YES YES NO NO
title: Mulliken charges:
elementType: O O O O C C C C C C C C C H H H H H H H H H H H H H H
charge: -0.417256 -0.240457 -0.415100 -0.231392 0.284800 -0.078367 -0.226493 -0.557453 -0.752532 -0.752274 -0.563040 0.134776 0.176371 0.252229 0.272070 0.236504 0.266498 0.220746 0.243098 0.213769 0.230252 0.212208 0.218031 0.265733 0.255624 0.374287 0.377368
chargesum: 0.00000
title: Mulliken charges with hydrogens summed into heavy atoms:
elementType: O O O O C C C C C C C C C
charge: -0.042969 -0.240457 -0.037732 -0.231392 0.284800 0.173862 0.045578 -0.054451 -0.074919 -0.091782 -0.041683 0.134776 0.176371
polarizability: 1.27240581e+02 -2.47594246e+00 9.62061438e+01 1.23763399e+00 -6.41411127e-01 9.49310338e+01
1716.lowfreq: -13.9409 -8.4901 -0.0005 0.0006 0.0007 11.8801 24.7522 39.6381 41.3774
frequency: 24.5933 39.5616 41.2940 74.6397 106.4393 141.4582 177.3105 205.0045 221.0005 264.1418 266.4186 298.8659 329.1230 348.4373 411.1043 451.2708 491.5647 506.8311 565.5367 580.1356 597.3324 620.2554 641.5885 677.9955 759.3521 801.8577 848.6119 865.9117 892.1070 921.0881 937.9486 970.2445 982.6325 996.4211 1031.6980 1048.5820 1078.9483 1104.2373 1138.9636 1152.5585 1165.0561 1188.6092 1214.3306 1226.0053 1238.1426 1247.0512 1256.8819 1286.6870 1322.6189 1358.5139 1380.4957 1388.4749 1396.4832 1433.7743 1462.1901 1465.0480 1468.5400 1482.2657 1484.1445 1653.6412 1664.6928 2966.9646 2977.5667 2985.1201 3012.3057 3028.3174 3052.2933 3053.8404 3060.4968 3066.7706 3070.6154 3081.2134 3110.5229 3503.2696 3509.3855
redmass: 10.3366 6.8530 6.6990 3.2314 4.2049 3.2969 1.9951 1.5548 2.4753 2.1667 1.2735 4.1160 3.3209 2.4656 3.7103 2.9769 2.0038 2.4439 3.3143 3.1438 3.3602 1.5771 1.3947 2.6027 3.5233 2.7710 3.4674 2.1543 2.5918 2.0057 1.4122 1.8793 1.4273 2.3753 2.3035 2.5267 2.0003 1.7608 2.0025 1.8365 1.9824 1.2974 1.2879 1.6765 1.8685 1.6240 1.9115 1.9545 1.6842 1.9322 1.2275 1.8618 1.2065 1.0877 1.0554 1.0698 1.0879 1.0566 1.0532 8.1021 8.2147 1.0356 1.0370 1.0628 1.0847 1.0615 1.0871 1.0946 1.0978 1.0988 1.0990 1.0993 1.1054 1.0639 1.0639
irintensity: 1.1560 0.9844 0.4980 0.7921 0.7430 0.4627 0.3643 1.1186 1.1656 1.5238 0.3025 1.4742 1.0536 0.7395 29.5519 20.0627 27.9615 15.6341 31.9016 9.0429 3.8815 95.5444 132.2088 37.3411 13.2933 6.5949 3.9463 1.7934 2.4759 2.0410 2.8137 34.7387 2.7578 30.1028 260.8369 236.6155 38.4043 12.1590 21.4699 9.4964 36.2658 7.3079 0.4076 13.3484 6.7653 8.8065 1.0251 14.9251 72.2639 4.6394 27.7833 56.8913 14.8913 28.2570 5.8187 2.6591 14.0324 11.7158 14.8498 198.5221 196.7721 26.7381 18.6872 15.3681 8.2960 16.1199 3.4259 10.8655 13.2274 37.4647 45.3051 27.5457 21.0727 18.7532 20.8236
temp: 298.150 k
press: 1.00000 atm
elementType: 8 8 8 8 6 6 6 6 6 6 6 6 6 1 1 1 1 1 1 1 1 1 1 1 1 1 1
symmnumber: 1
zpe: 573462.2 jmol-1
zpe.correction: 0.218420 hartree
zpe.thermalcorrener: 0.232654 hartree
zpe.thermalcorrenthalpy: 0.233598 hartree
zpe.thermalcorrgfe: 0.175839 hartree
zpe.sumelectzpe: -651.234775 hartree
zpe.sumelectthermal: -651.220541 hartree
zpe.sumelectthermalent: -651.219597 hartree
zpe.sumelectthermalfe: -651.277356 hartree
dipole: -0.0229 2.0126 0.5123
dipole: 2.0769
quadrupole: -68.1500 -79.9322 -83.2002
quadrupole: -2.0101 3.8045 1.7314
quadrupole: 8.9441 -2.8380 -6.1061 -2.0101 3.8045 1.7314
hfenergy: -651.4531957 hartree
pointgroup: C01 [X(C9H14O4)]
dipole: -0.0009977 0.8064634 -0.1315842 debye
polarizability: 127.2076242|2.7068234|96.1403823|1.1608226|0.7349353|95.0297521 unknown
InChI: InChI=1S/C9H14O4/c1-9(2)5(4-7(10)11)3-6(9)8(12)13/h5-6,10,12H,3-4H2,1-2H3
charge 0 multiplicity 1
27 atoms
O  3.791488 -0.262039 0.341254
O  2.548576 -1.588762 -1.101992
O  -4.142026 -0.287296 -0.913916
O  -3.264947 -0.742197 1.18587
C  0.677692 1.051985 0.04932
C  -0.690814 0.350845 0.442098
C  1.403521 -0.258263 0.634502
C  0.050812 -1.023218 0.521307
C  0.87972 1.215511 -1.470975
C  1.009501 2.354797 0.793077
C  -1.900648 0.486504 -0.486355
C  2.578068 -0.79701 -0.131134
C  -3.120404 -0.240848 0.049431
H  -0.984673 0.668998 1.46024
H  1.704927 -0.071741 1.679003
H  -0.001137 -1.588656 -0.425851
H  -0.216717 -1.688567 1.355337
H  1.909587 1.555435 -1.68813
H  0.719272 0.272235 -2.022434
H  0.186394 1.976815 -1.874089
H  2.065744 2.641367 0.632635
H  0.374579 3.187355 0.433124
H  0.846594 2.249544 1.881428
H  -1.689691 0.102396 -1.501142
H  -2.187131 1.550245 -0.617863
H  4.538127 -0.618834 -0.213666
H  -4.931414 -0.757399 -0.529077
