program: Gaussian 09
title: 000146892
version: EM64L-G09RevD.01
frameworkgroup: C1[X(C12H17NO3)]
method: RPBEPBE
basis: SDD
operation: Freq
keyword: #p
keyword: freq=noraman
keyword: PBEPBE/SDD
title: #p freq=noraman PBEPBE/SDD
converged: YES YES NO NO
title: Mulliken charges:
elementType: O O O N C C C C C C C C C C C C H H H H H H H H H H H H H H H H H
charge: -0.265979 -0.205774 -0.266533 -0.308146 0.469984 -0.256272 -0.394019 0.351744 -0.330044 -0.438148 -0.453640 -0.375351 -0.351155 -0.678899 0.281783 -0.756500 0.201133 0.200381 0.219478 0.218904 0.287602 0.226229 0.209187 0.238926 0.250194 0.245067 0.209850 0.227520 0.209441 0.310474 0.257764 0.255145 0.209654
chargesum: 0.00000
title: Mulliken charges with hydrogens summed into heavy atoms:
elementType: O O O N C C C C C C C C C C C C
charge: -0.265979 -0.205774 -0.266533 0.002328 0.469984 0.145242 0.044364 0.351744 -0.042442 -0.211919 -0.005527 -0.125157 -0.106088 -0.032088 0.281783 -0.033936
polarizability: 2.44000715e+02 -4.65553301e-01 1.40057515e+02 2.03228608e+00 1.22348895e+00 8.83960857e+01
1716.lowfreq: -11.1349 -5.6143 -0.0007 0.0005 0.0008 1.3171 19.0233 25.7829 50.1573
frequency: 18.5968 25.3537 50.1414 63.8896 75.9984 87.0818 94.9524 111.8152 123.2089 143.8951 195.0677 230.2072 241.9255 264.4961 283.5316 323.8844 349.6164 393.3706 403.4504 417.8954 430.3100 474.9299 522.8303 558.5397 602.9588 630.8258 636.5364 721.0707 765.3509 767.9402 803.5856 827.2074 835.5337 860.1526 894.7297 901.8321 903.1055 935.1495 954.7857 976.7805 983.0940 991.3129 1005.0255 1027.9342 1036.4722 1053.9070 1119.8065 1136.1364 1142.0475 1173.6180 1178.5172 1223.1119 1230.0685 1236.2612 1237.2051 1284.8682 1308.7859 1310.1493 1337.8464 1375.3049 1381.9121 1389.8529 1396.9257 1414.7924 1421.6911 1448.4525 1465.1918 1468.2898 1472.3887 1479.4174 1481.5890 1489.9633 1504.9859 1582.9916 1617.6893 1624.8460 2943.4514 2978.0125 2996.6169 2997.9143 3001.1634 3004.6629 3052.2860 3078.2318 3080.6494 3083.1696 3098.1700 3103.2138 3121.4780 3139.3959 3165.0983 3167.9844 3528.5974
redmass: 5.1378 4.2867 3.2828 4.1128 4.1635 2.0267 1.6111 3.5610 1.8778 2.8721 4.6274 1.1502 3.5256 6.1798 4.2088 3.2948 3.3594 2.4778 1.6133 3.0580 4.1769 3.7805 2.9119 4.8961 2.6728 6.5129 5.4450 3.6454 5.2056 1.0904 1.8020 3.3496 2.2980 2.0527 1.1531 2.4276 2.2794 1.3924 2.5623 1.7816 4.5298 1.5230 2.5993 3.0312 1.6140 2.7630 1.3275 2.1711 1.4427 1.0954 1.2773 2.3892 1.2699 2.2038 3.1858 1.1032 1.2923 1.3565 1.3173 1.7008 1.2835 2.6476 1.3191 1.5586 3.5966 1.0466 1.1235 1.0974 1.0855 1.0834 1.0416 1.1232 2.3505 6.9286 7.5701 6.3266 1.0549 1.0362 1.0361 1.0591 1.1063 1.0602 1.1014 1.1062 1.1029 1.0988 1.1001 1.0987 1.0896 1.0906 1.0943 1.0952 1.0804
irintensity: 3.4205 1.5461 1.3401 7.9445 1.7651 2.8156 1.7642 4.5633 0.5421 4.8054 1.8401 0.0070 3.5461 6.4760 2.9897 1.3580 2.1642 18.2002 95.8485 0.6794 8.8403 0.2203 20.8408 13.0434 3.0050 0.8248 25.8245 4.9653 2.6732 15.0005 69.1480 47.4857 13.9986 20.4663 2.4227 12.3748 6.6969 1.2592 37.1594 9.6630 94.3917 1.4008 5.3522 15.4316 10.8309 7.0654 13.6362 6.1817 0.2292 2.0734 128.2665 181.5452 0.6919 43.2074 99.4895 0.0222 8.9267 0.6831 43.3201 1.4303 64.8954 12.3983 32.9202 79.2648 7.9407 15.0893 8.4867 18.4819 19.9562 4.4675 13.5819 46.6267 78.6440 15.7591 126.5810 130.8924 37.6798 39.5422 11.9326 51.4841 30.3873 23.7924 0.0430 12.7751 83.6420 44.6005 19.3611 8.1791 17.7144 0.2514 11.2882 12.1994 18.8321
temp: 298.150 k
press: 1.00000 atm
elementType: 8 8 8 7 6 6 6 6 6 6 6 6 6 6 6 6 1 1 1 1 1 1 1 1 1 1 1 1 1 1 1 1 1
symmnumber: 1
zpe: 708638.3 jmol-1
zpe.correction: 0.269906 hartree
zpe.thermalcorrener: 0.287394 hartree
zpe.thermalcorrenthalpy: 0.288338 hartree
zpe.thermalcorrgfe: 0.222063 hartree
zpe.sumelectzpe: -746.620334 hartree
zpe.sumelectthermal: -746.602846 hartree
zpe.sumelectthermalent: -746.601901 hartree
zpe.sumelectthermalfe: -746.668177 hartree
dipole: -0.5312 3.9232 -0.0266
dipole: 3.9591
quadrupole: -56.7074 -93.6966 -98.3403
quadrupole: -6.7384 -2.2915 -1.5660
quadrupole: 26.2074 -10.7818 -15.4255 -6.7384 -2.2915 -1.5660
hfenergy: -746.8902396 hartree
pointgroup: C01 [X(C12H17N1O3)]
dipole: 0.2084125 0.1668468 -1.5345679 debye
polarizability: 242.5125376|15.2658544|90.0769032|0.8787087|-3.3175813|139.8648755 unknown
InChI: InChI=1S/C12H17NO3/c1-3-8-15-12-6-4-11(5-7-12)9-16-13-10(2)14/h4-7,13H,3,8-9H2,1-2H3
charge 0 multiplicity 1
33 atoms
O  -3.166407 -0.448855 0.711694
O  2.946545 -0.522989 -0.97054
O  3.957611 0.447301 1.468427
N  4.32755 -0.209078 -0.738276
C  0.724808 0.432127 -0.712384
C  -4.319385 -0.513173 -0.205356
C  -5.550737 -0.840621 0.642594
C  -1.907448 -0.155952 0.168105
C  0.461011 0.19244 0.665884
C  -0.344377 0.364579 -1.633476
C  2.125711 0.751345 -1.151825
C  -0.839948 -0.100708 1.103225
C  -1.661684 0.076909 -1.208141
C  -6.828623 -0.931666 -0.219927
C  4.757161 0.168276 0.527762
C  6.276438 0.255496 0.662133
H  -4.14445 -1.298347 -0.971077
H  -4.441043 0.46311 -0.720741
H  -5.375535 -1.796018 1.17113
H  -5.666225 -0.06116 1.418571
H  1.294901 0.22813 1.376458
H  -0.153574 0.537432 -2.700027
H  2.180414 1.044522 -2.217215
H  2.590902 1.52302 -0.515678
H  -1.059778 -0.288408 2.158623
H  -2.469955 0.035457 -1.943687
H  -6.742316 -1.724282 -0.986911
H  -7.706946 -1.166196 0.406848
H  -7.033082 0.022842 -0.740688
H  4.953236 -0.536717 -1.477952
H  6.597151 -0.428091 1.467014
H  6.554667 1.279355 0.964123
H  6.820207 -0.00388 -0.263189
