program: Gaussian 09
title: 000146934
version: EM64L-G09RevD.01
frameworkgroup: C1[X(C16H23ClN2O3)]
method: RPBEPBE
basis: SDD
operation: Freq
keyword: #p
keyword: freq=noraman
keyword: PBEPBE/SDD
title: #p freq=noraman PBEPBE/SDD
converged: YES YES NO NO
title: Mulliken charges:
elementType: Cl O O O N N C C C C C C C C C C C C C C C C H H H H H H H H H H H H H H H H H H H H H H H
charge: -0.037395 -0.281882 -0.268261 -0.450500 -0.121895 -0.337284 -0.007286 -0.469498 -0.454302 -0.369610 -0.459586 -0.638496 0.164153 0.040146 -0.006016 0.326062 0.457598 -0.600917 -0.444126 -0.331902 -0.662810 -0.519138 0.256325 0.218975 0.211889 0.217475 0.219398 0.226374 0.175926 0.249497 0.229726 0.219652 0.238265 0.192829 0.337605 0.245470 0.203857 0.261302 0.213215 0.227148 0.238939 0.373330 0.273464 0.215581 0.226704
chargesum: 0.00000
title: Mulliken charges with hydrogens summed into heavy atoms:
elementType: Cl O O O N N C C C C C C C C C C C C C C C C
charge: -0.037395 -0.281882 -0.268261 -0.077170 -0.121895 0.000320 0.249039 -0.038635 -0.017430 0.032691 0.019638 0.012249 0.164153 0.040146 -0.006016 0.326062 0.457598 -0.151591 -0.182824 -0.331902 0.016493 0.196611
polarizability: 2.62309347e+02 -3.20814019e+00 2.31037198e+02 1.27819666e+01 -4.49833199e+00 1.45128457e+02
1716.lowfreq: -5.8303 -3.7977 -0.0014 -0.0013 0.0008 3.4303 16.4431 23.6576 26.5098
frequency: 16.0599 23.6101 26.4296 45.5764 52.5158 67.4556 68.4209 75.6020 118.7532 134.7345 144.6236 148.5786 167.3328 179.4624 188.5810 197.5313 204.7049 221.5068 241.9555 262.4565 269.1366 285.2992 297.2226 302.0539 314.5940 339.9825 345.3117 379.3884 396.3272 417.7024 445.9163 451.2064 486.5044 539.4379 560.5049 566.5798 598.7506 605.0056 642.8375 681.3982 690.9739 724.0523 772.1145 784.2427 799.6570 807.8691 829.9576 852.7617 875.8808 878.6790 899.1191 910.1334 926.5619 972.3074 986.1433 999.3328 1011.5746 1041.3804 1045.8824 1060.8942 1078.9902 1091.1958 1100.9259 1108.2275 1123.7420 1151.8563 1153.8583 1162.8627 1170.9185 1186.7243 1203.2949 1206.4454 1209.3791 1231.0774 1238.8017 1259.3842 1271.6408 1277.3926 1294.0590 1302.2688 1309.6289 1313.8210 1340.5918 1344.6166 1355.4952 1360.2251 1390.2589 1399.4180 1417.0814 1434.1582 1441.0837 1444.4090 1456.9637 1461.5691 1468.8486 1471.4712 1476.5862 1479.2820 1480.2235 1483.2115 1495.3507 1497.3087 1503.7854 1562.3233 1588.1764 1608.8862 2843.2744 2860.7729 2932.4461 2948.9885 2981.1339 2982.8645 3002.7246 3007.3462 3011.7729 3018.0422 3023.0011 3039.5050 3058.6997 3073.9999 3078.1571 3079.5850 3083.3999 3090.5099 3093.6912 3130.7700 3152.7358 3544.6193 3588.6447
redmass: 4.1273 3.6573 4.4905 3.7223 3.5090 3.9366 3.4728 4.2264 4.8725 4.5098 3.0717 1.0522 3.2432 2.7989 1.6873 1.2838 2.1996 2.6368 3.7965 3.2459 3.0438 1.8456 2.2389 2.8310 3.2235 3.1009 4.0125 6.4687 6.7452 2.2346 5.0699 5.0478 3.6845 4.7590 2.4693 1.4047 2.7771 3.1210 6.3697 7.1914 6.6815 5.3878 4.0666 1.2556 6.5693 2.7147 2.0166 3.0415 2.5728 1.4033 5.9698 2.0635 2.2769 2.2890 2.6346 2.0607 2.7850 2.1998 1.7274 1.8698 2.2456 2.0400 1.3545 1.2524 1.6966 1.9708 1.3221 2.9713 1.4931 1.6375 2.4667 1.8665 1.8947 1.4098 1.3660 1.3703 2.5799 3.2218 1.3407 1.3061 1.3697 1.7669 1.4545 1.3787 3.5825 1.4870 1.9133 1.2799 3.2831 1.1256 1.1931 1.6680 1.1202 1.0906 1.0500 1.0427 1.0867 1.0581 1.0566 1.0628 1.0930 1.1084 1.8049 7.8813 6.6300 7.4763 1.0708 1.0575 1.0840 1.0696 1.0368 1.0302 1.0614 1.0684 1.0587 1.0740 1.0818 1.0917 1.1022 1.0987 1.1009 1.1044 1.1051 1.1005 1.1033 1.1043 1.0926 1.0786 1.0654
irintensity: 0.5541 0.6514 0.3202 3.3365 0.0379 3.4617 4.1626 1.8161 1.3381 2.6251 8.4985 0.5653 1.0199 5.1314 1.5541 1.2855 0.4812 8.7794 3.2337 3.7517 10.9074 35.7440 46.8209 13.2315 5.3532 3.1846 4.6914 4.7833 1.7385 8.4257 23.2117 4.3565 26.8662 25.4652 2.1598 96.7966 2.1481 1.0178 18.4136 6.0280 7.9208 20.6139 50.6237 5.7057 8.7370 2.2558 13.5568 2.7316 2.2298 15.4730 21.9922 6.4931 6.6291 6.3539 50.9070 9.4797 30.7947 3.1240 46.3063 7.0660 32.4892 7.7984 4.8784 7.5109 1.1067 26.7917 5.9357 24.9657 5.3572 119.1516 17.1747 39.4915 2.9100 3.6050 28.8947 39.8167 80.9680 70.9994 5.7508 2.0931 0.1184 11.4824 0.7045 3.6644 8.1413 16.1791 14.1007 27.2571 39.4738 12.1174 9.0258 69.0148 18.3258 10.2036 24.8155 12.0190 8.0317 16.0975 1.8707 1.1982 3.5353 29.1521 296.8397 21.8122 141.4103 69.0155 95.5522 164.6433 31.9809 38.2680 31.7933 68.2211 14.5510 55.7263 33.0410 45.2854 76.5309 5.1629 17.3312 57.2422 21.5615 39.9032 49.2639 29.7279 16.4035 17.7036 2.1024 36.7483 32.2705
temp: 298.150 k
press: 1.00000 atm
elementType: 17 8 8 8 7 7 6 6 6 6 6 6 6 6 6 6 6 6 6 6 6 6 1 1 1 1 1 1 1 1 1 1 1 1 1 1 1 1 1 1 1 1 1 1 1
symmnumber: 1
zpe: 965476.5 jmol-1
zpe.correction: 0.367731 hartree
zpe.thermalcorrener: 0.391806 hartree
zpe.thermalcorrenthalpy: 0.392750 hartree
zpe.thermalcorrgfe: 0.311580 hartree
zpe.sumelectzpe: -1417.026595 hartree
zpe.sumelectthermal: -1417.002519 hartree
zpe.sumelectthermalent: -1417.001575 hartree
zpe.sumelectthermalfe: -1417.082745 hartree
dipole: 1.5796 -4.6170 0.9926
dipole: 4.9796
quadrupole: -123.9789 -125.3652 -142.7597
quadrupole: -14.7883 -6.0067 -5.4304
quadrupole: 6.7224 5.3361 -12.0584 -14.7883 -6.0067 -5.4304
hfenergy: -1417.3943255 hartree
pointgroup: C01 [X(C16H23Cl1N2O3)]
dipole: -0.8992047 1.1927486 1.2676564 debye
polarizability: 262.2484822|9.5819423|202.6384671|-11.0427474|40.2338322|173.5880529 unknown
InChI: InChI=1S/C16H23ClN2O3/c1-4-10-8-12(17)15(22-3)13(14(10)20)16(21)18-9-11-6-5-7-19(11)2/h8,11,18,20H,4-7,9H2,1-3H3
charge 0 multiplicity 1
45 atoms
Cl -3.72195 -3.417851 -1.233851
O  0.654353 0.00059 -1.864001
O  -0.844462 -2.40907 -1.382922
O  -1.622176 1.806621 0.900036
N  4.64044 0.632129 -0.22469
N  0.882688 0.804917 0.300075
C  3.315101 0.142424 0.261676
C  3.555508 -0.263431 1.747176
C  4.936906 0.352661 2.103575
C  5.686436 0.268859 0.758954
C  2.262316 1.26952 0.076539
C  4.952558 0.337633 -1.629977
C  0.162184 0.198895 -0.705668
C  -1.256008 -0.220524 -0.365424
C  -2.153548 0.612904 0.354841
C  -1.735118 -1.475757 -0.85209
C  -3.524081 0.282631 0.540828
C  -4.478768 1.225968 1.260267
C  -3.981019 -0.945768 0.01609
C  -3.098701 -1.807222 -0.656227
C  -4.937807 2.421678 0.37811
C  -0.778984 -2.510387 -2.862992
H  2.965853 -0.733855 -0.328112
H  3.601015 -1.364005 1.836668
H  2.744329 0.085388 2.411272
H  4.829725 1.410595 2.40512
H  5.451879 -0.190034 2.914952
H  6.543552 0.965133 0.694011
H  6.07799 -0.769554 0.600891
H  2.340425 1.655436 -0.955524
H  2.482705 2.096224 0.77506
H  5.861103 0.887052 -1.938295
H  4.121407 0.664463 -2.278975
H  5.124684 -0.751565 -1.822464
H  0.385879 1.080736 1.148936
H  -5.371624 0.65807 1.577145
H  -4.027515 1.605889 2.20256
H  -5.026766 -1.239208 0.151818
H  -4.08767 3.033505 0.021285
H  -5.62309 3.083537 0.937732
H  -5.468622 2.055195 -0.517691
H  -2.339923 2.360252 1.29456
H  -0.323718 -1.586245 -3.255716
H  -1.784752 -2.686971 -3.287247
H  -0.132134 -3.37866 -3.05821
