program: Gaussian 09
title: 000146906
version: EM64L-G09RevD.01
frameworkgroup: C1[X(C13H9F3N2O3)]
method: RPBEPBE
basis: SDD
operation: Freq
keyword: #p
keyword: freq=noraman
keyword: PBEPBE/SDD
title: #p freq=noraman PBEPBE/SDD
converged: YES YES NO NO
title: Mulliken charges:
elementType: F F F O O O N N C C C C C C C C C C C C C H H H H H H H H H
charge: -0.166553 -0.164931 -0.159283 -0.250650 -0.203894 -0.168399 0.009606 -0.694794 0.222976 0.329468 0.271220 -0.480377 -0.299819 -0.329062 0.314440 0.260795 -0.333572 -0.350707 0.506559 -0.391725 -0.385956 0.312881 0.286505 0.266308 0.259848 0.261604 0.226990 0.226927 0.311920 0.311673
chargesum: 0.00000
title: Mulliken charges with hydrogens summed into heavy atoms:
elementType: F F F O O O N N C C C C C C C C C C C C C
charge: -0.166553 -0.164931 -0.159283 -0.250650 -0.203894 -0.168399 0.009606 -0.071200 0.222976 0.329468 0.271220 -0.167496 -0.013314 -0.062754 0.314440 0.260795 -0.073724 -0.089103 0.506559 -0.164735 -0.159028
polarizability: 2.69402426e+02 -2.50070179e+01 1.66755897e+02 -1.40748729e+01 -6.87323660e+00 1.12864921e+02
1716.lowfreq: -0.0008 -0.0006 -0.0005 0.8445 3.9694 6.3411 9.2665 22.6383 34.5077
frequency: 7.5985 22.5505 34.4903 38.8436 46.8760 81.5833 121.8436 132.3400 145.2110 176.7980 221.0739 250.8772 287.1021 321.4071 332.3601 365.1558 371.1300 374.7287 386.7539 392.9234 411.4658 415.0253 423.9378 473.3067 488.7866 504.2232 524.6986 562.7997 590.1347 621.3220 635.1379 652.9167 673.7488 691.5156 710.4562 737.3323 745.4218 793.1431 805.5907 824.6378 827.8479 835.6292 871.0971 930.6629 935.7927 947.4694 969.2904 983.8895 995.0599 1017.3807 1030.8884 1037.0934 1066.0271 1123.8847 1147.2278 1164.5550 1184.0965 1201.8181 1242.1295 1250.0587 1294.8349 1300.7024 1320.7479 1364.2759 1381.8733 1389.0686 1425.8433 1436.4757 1487.5168 1505.2835 1573.2223 1589.6601 1623.9716 1629.7117 1647.1135 3130.9374 3134.3289 3157.8336 3158.8032 3171.8266 3178.5876 3183.3150 3567.1326 3706.0123
redmass: 16.8812 4.7861 5.7563 11.0227 6.8700 8.0391 9.6415 6.0230 6.7981 7.5137 10.2865 10.5109 8.0790 5.1066 9.3509 7.3885 3.2090 1.1364 1.7291 4.1484 3.5816 2.7651 4.6000 7.0015 5.5633 4.9156 4.8081 5.7852 8.3286 5.0291 6.8099 8.3321 7.2410 6.7535 4.3412 6.6115 5.1927 5.9061 1.2840 2.2385 3.3289 1.5524 7.7124 1.5319 1.3545 1.3459 1.3496 8.0643 2.9131 1.4290 6.6840 7.7519 3.0665 1.1940 2.1172 1.3409 1.3655 8.1155 3.0219 2.0339 2.5761 1.3449 3.1388 7.4439 6.2046 6.3314 5.8517 3.5962 3.0918 3.0921 8.4356 7.4234 5.1165 4.0617 1.3777 1.0888 1.0894 1.0908 1.0947 1.0960 1.0957 1.0929 1.0451 1.1040
irintensity: 0.4154 0.0886 0.3880 0.7685 0.2552 2.4362 2.9371 1.7576 1.2274 0.1796 0.4676 2.1447 1.2538 1.5045 0.8207 3.3339 31.0675 1.1911 197.1478 93.7940 3.5309 0.5700 1.0719 0.7824 11.5509 7.2215 7.0788 18.7375 20.4019 3.8573 1.5782 16.8365 1.2686 2.5303 9.8907 12.4693 13.5810 33.1282 4.0971 92.4121 28.5023 31.3412 1.7161 67.6019 3.1208 0.1783 1.2404 191.1797 14.0232 0.1180 127.1437 202.6455 32.5643 20.6410 16.9523 8.5897 132.9481 314.0318 126.4899 306.2705 325.6247 13.6211 17.1263 108.3702 26.2779 1.1892 5.4607 1.9675 211.1957 167.6322 35.0683 1.4586 89.0903 94.2141 261.3262 12.7758 26.8738 1.9747 3.7061 1.5167 0.3974 9.1249 105.4131 24.1944
temp: 298.150 k
press: 1.00000 atm
elementType: 9 9 9 8 8 8 7 7 6 6 6 6 6 6 6 6 6 6 6 6 6 1 1 1 1 1 1 1 1 1
symmnumber: 1
zpe: 529456.6 jmol-1
zpe.correction: 0.201659 hartree
zpe.thermalcorrener: 0.220284 hartree
zpe.thermalcorrenthalpy: 0.221228 hartree
zpe.thermalcorrgfe: 0.150847 hartree
zpe.sumelectzpe: -1133.898978 hartree
zpe.sumelectthermal: -1133.880354 hartree
zpe.sumelectthermalent: -1133.879409 hartree
zpe.sumelectthermalfe: -1133.949791 hartree
dipole: 8.3455 -5.4802 -0.4159
dipole: 9.9927
quadrupole: -96.3926 -136.2394 -114.6893
quadrupole: -16.3267 1.2636 -4.6326
quadrupole: 19.3811 -20.4656 1.0844 -16.3267 1.2636 -4.6326
hfenergy: -1134.1006378 hartree
pointgroup: C01 [X(C13H9F3N2O3)]
dipole: 3.1380811 -2.3612087 0.1822527 debye
polarizability: 266.6183868|-31.8536247|168.7282243|-5.1138|-12.3796627|113.6766336 unknown
InChI: InChI=1S/C13H9F3N2O3/c14-13(15,16)8-1-6-12(11(7-8)18(19)20)21-10-4-2-9(17)3-5-10/h1-7H,17H2
charge 0 multiplicity 1
30 atoms
F  -4.285218 -2.159574 -1.099223
F  -4.42863 -1.686262 1.107043
F  -5.115537 -0.155031 -0.418959
O  1.184333 1.070269 -0.179501
O  -2.058336 3.522315 0.369487
O  -0.062698 3.392155 -0.730215
N  -1.091514 2.854096 -0.176441
N  5.917757 -1.931794 0.585811
C  -0.081952 0.512106 -0.206242
C  -2.727838 -0.533993 -0.198559
C  -1.217808 1.37811 -0.180969
C  -2.526417 0.855555 -0.155222
C  -0.309002 -0.891574 -0.245514
C  -1.611503 -1.408162 -0.251273
C  2.336091 0.226873 0.010199
C  -4.110788 -1.109362 -0.158378
C  2.578159 -0.393598 1.253313
C  3.276534 0.157304 -1.034728
C  4.736754 -1.217079 0.396735
C  3.77049 -1.117074 1.443282
C  4.471096 -0.563679 -0.8441
H  -3.365339 1.554775 -0.10745
H  0.550711 -1.565769 -0.276291
H  -1.765283 -2.490585 -0.302944
H  1.851913 -0.300693 2.067631
H  3.074162 0.674228 -1.977426
H  3.962993 -1.597138 2.409798
H  5.205851 -0.617284 -1.655718
H  6.615419 -1.99059 -0.150017
H  6.119798 -2.381945 1.473571
